BDBM32725 4-(1,3-dioxo-1,3-dihydro-2H-isoindol-2-yl)-N-(tetrahydro-2-furanylmethyl)butanamide::4-(1,3-dioxo-2-isoindolyl)-N-(2-oxolanylmethyl)butanamide::4-(1,3-dioxoisoindol-2-yl)-N-(oxolan-2-ylmethyl)butanamide::4-[1,3-bis(oxidanylidene)isoindol-2-yl]-N-(oxolan-2-ylmethyl)butanamide::4-phthalimido-N-(tetrahydrofurfuryl)butyramide::MLS000536893::SMR000143540::cid_2953906
SMILES O=C(CCCN1C(=O)c2ccccc2C1=O)NCC1CCCO1
InChI Key InChIKey=OWIAXRDCYXHLGB-UHFFFAOYSA-N
Data  2 IC50
  Tab Delimited (TSV)   2D SDfile   Computed 3D by Vconf -m prep SDfile
Find this compound or compounds like it in BindingDB:
Activity Spreadsheet -- Enzyme Inhibition Constant Data from BindingDB
Found 2 hits for monomerid = 32725
TargetCoagulation factor XI(Homo sapiens (Human))
Pcmd
Curated by PubChem BioAssay
LigandPNGBDBM32725(4-(1,3-dioxo-1,3-dihydro-2H-isoindol-2-yl)-N-(tetr...)
Affinity DataIC50:  1.46E+4nM. Assay description: Molecular Library Screening Center Network (MLSCN) Penn Center for Molecular Discovery (PCMD) Assay Provider: Scott L. Diamond, University of Pennsy...
In DepthDetails PCBioAssay
TargetCoagulation factor XI(Homo sapiens (Human))
Pcmd
Curated by PubChem BioAssay
LigandPNGBDBM32725(4-(1,3-dioxo-1,3-dihydro-2H-isoindol-2-yl)-N-(tetr...)
Affinity DataIC50:  1.46E+4nMpH: 7.4 T: 2°C. Assay description: Factor XIa (0.23 ug/mL) was incubated with Boc-Glu-Ala-Arg-AMC substrate (15 uM) in 10 uL of assay buffer for 2 hr at room temperature. Read fluoresc...
In DepthDetails PCBioAssay