BDBM32773 MLS000057551::N-[4-(5-chloranylthiophen-2-yl)-1,3-thiazol-2-yl]thiophene-2-carboxamide::N-[4-(5-chloro-2-thienyl)thiazol-2-yl]thiophene-2-carboxamide::N-[4-(5-chloro-2-thiophenyl)-2-thiazolyl]-2-thiophenecarboxamide::N-[4-(5-chlorothiophen-2-yl)-1,3-thiazol-2-yl]thiophene-2-carboxamide::SMR000065041::cid_2168035
SMILES Clc1ccc(s1)-c1csc(NC(=O)c2cccs2)n1
InChI Key InChIKey=SZEJCYRSPJKVSH-UHFFFAOYSA-N
Data  4 IC50
  Tab Delimited (TSV)   2D SDfile   Computed 3D by Vconf -m prep SDfile
Find this compound or compounds like it in BindingDB:
Activity Spreadsheet -- Enzyme Inhibition Constant Data from BindingDB
Found 4 hits for monomerid = 32773
TargetCoagulation factor XI(Homo sapiens (Human))
Pcmd
Curated by PubChem BioAssay
LigandPNGBDBM32773(MLS000057551 | N-[4-(5-chloranylthiophen-2-yl)-1,3...)
Affinity DataIC50:  364nMpH: 7.4 T: 2°C. Assay description: Factor XIa (0.23 ug/mL) was incubated with Boc-Glu-Ala-Arg-AMC substrate (15 uM) in 10 uL of assay buffer for 2 hr at room temperature. Read fluoresc...
In DepthDetails PCBioAssay
TargetHeat shock protein hsp-16.2(Caenorhabditis elegans)
Burnham Center For Chemical Genomics
Curated by PubChem BioAssay
LigandPNGBDBM32773(MLS000057551 | N-[4-(5-chloranylthiophen-2-yl)-1,3...)
Affinity DataIC50: >6.40E+4nM
In DepthDetails PCBioAssay
TargetProtein skinhead-1(Caenorhabditis elegans)
Burnham Center For Chemical Genomics
Curated by PubChem BioAssay
LigandPNGBDBM32773(MLS000057551 | N-[4-(5-chloranylthiophen-2-yl)-1,3...)
Affinity DataIC50:  6.63E+3nM
In DepthDetails PCBioAssay
TargetCoagulation factor XII(Homo sapiens (Human))
Pcmd
Curated by PubChem BioAssay
LigandPNGBDBM32773(MLS000057551 | N-[4-(5-chloranylthiophen-2-yl)-1,3...)
Affinity DataIC50:  2.39E+4nM. Assay description: Molecular Library Screening Center Network (MLSCN) Penn Center for Molecular Discovery (PCMD) Assay Provider: Scott L. Diamond, University of Pennsy...
In DepthDetails PCBioAssay