BDBM32920 4-methoxybenzoic acid [(7,7-diketo-5,6-dihydrothieno[2,3-b]thiopyran-4-ylidene)amino] ester::4-methoxybenzoic acid [(7,7-dioxo-5,6-dihydrothieno[2,3-b]thiopyran-4-ylidene)amino] ester::4-{[(4-methoxybenzoyl)oxy]imino}-3,4-dihydro-1lambda~6~-thieno[2,3-b]thiopyran-1,1(2H)-dione::MLS000721110::SMR000335305::[(7,7-dioxo-5,6-dihydrothieno[2,3-b]thiopyran-4-ylidene)amino] 4-methoxybenzoate::[[7,7-bis(oxidanylidene)-5,6-dihydrothieno[2,3-b]thiopyran-4-ylidene]amino] 4-methoxybenzoate::cid_1480172
SMILES COc1ccc(cc1)C(=O)ON=C1CCS(=O)(=O)c2sccc12
InChI Key InChIKey=YGEOTMZIYIVDOT-UHFFFAOYSA-N
Data  1 IC50
  Tab Delimited (TSV)   2D SDfile   Computed 3D by Vconf -m prep SDfile
Find this compound or compounds like it in BindingDB:
Activity Spreadsheet -- Enzyme Inhibition Constant Data from BindingDB
Found 1 hit for monomerid = 32920
TargetCoagulation factor XI(Homo sapiens (Human))
Pcmd
Curated by PubChem BioAssay
LigandPNGBDBM32920(4-methoxybenzoic acid [(7,7-diketo-5,6-dihydrothie...)
Affinity DataIC50:  1.42E+3nMpH: 7.4 T: 2°C. Assay description: Factor XIa (0.23 ug/mL) was incubated with Boc-Glu-Ala-Arg-AMC substrate (15 uM) in 10 uL of assay buffer for 2 hr at room temperature. Read fluoresc...
In DepthDetails PCBioAssay