BDBM330279 1-(3-(tert-butyl)-1-(p-tolyl)-1H-pyrazol-5-yl)- 3-(4-((2-(o-tolylamino)pyrimidin-4-yl)oxy) naphthalen-1-yl)urea::US10238658, Example 21::US10813932, Example 21::US9724347, Example 21::US9993478, Example 21
SMILES Cc1ccc(cc1)-n1nc(cc1NC(=O)Nc1ccc(Oc2ccnc(Nc3ccccc3C)n2)c2ccccc12)C(C)(C)C
InChI Key InChIKey=IHAAICCNNPXTHZ-UHFFFAOYSA-N
Data  12 IC50
  Tab Delimited (TSV)   2D SDfile   Computed 3D by Vconf -m prep SDfile
Find this compound or compounds like it in BindingDB:
Activity Spreadsheet -- Enzyme Inhibition Constant Data from BindingDB
Found 12 hits for monomerid = 330279
Target5-hydroxytryptamine receptor 2A(Homo sapiens (Human))
Respivert
US Patent
LigandPNGBDBM330279(1-(3-(tert-butyl)-1-(p-tolyl)-1H-pyrazol-5-yl)- 3-...)
Affinity DataIC50:  33nM. Assay description: The inhibitory activities of test compounds against the p38 MAPKα isoform (MAPK14: Invitrogen), were evaluated indirectly by determining the lev...
Ligand InfoPC cidPC sid
In DepthDetails US Patent
TargetMitogen-activated protein kinase 12(Homo sapiens (Human))
Respivert
US Patent
LigandPNGBDBM330279(1-(3-(tert-butyl)-1-(p-tolyl)-1H-pyrazol-5-yl)- 3-...)
Affinity DataIC50: >1.67E+3nM. Assay description: The inhibitory activities of compounds of the invention against p38MAPKγ (MAPK12: Invitrogen), were evaluated in a similar fashion to that descr...
Ligand InfoPC cidPC sid
In DepthDetails US Patent
TargetGlycogen synthase kinase-3 alpha(Homo sapiens (Human))
Respivert
US Patent
LigandPNGBDBM330279(1-(3-(tert-butyl)-1-(p-tolyl)-1H-pyrazol-5-yl)- 3-...)
Affinity DataIC50: >1.67E+3nM. Assay description: The GSK3-α protein (500 ng/mL, 2.5 μL) was mixed with the test compound (2.5 μL at either 4 μg/mL, 0.4 μg/mL, 0.04 μg/m...
Ligand InfoPC cidPC sid
In DepthDetails US Patent
TargetMitogen-activated protein kinase 14(Homo sapiens (Human))
Respivert
US Patent
LigandPNGBDBM330279(1-(3-(tert-butyl)-1-(p-tolyl)-1H-pyrazol-5-yl)- 3-...)
Affinity DataIC50:  33nM. Assay description: p38 MAPKα: The enzyme inhibitory activities of compounds disclosed herein were determined by FRET using synthetic peptides labelled with both do...
Ligand InfoPC cidPC sid
In DepthDetails US Patent
TargetMitogen-activated protein kinase 12(Homo sapiens (Human))
Respivert
US Patent
LigandPNGBDBM330279(1-(3-(tert-butyl)-1-(p-tolyl)-1H-pyrazol-5-yl)- 3-...)
Affinity DataIC50: >1.67E+3nM. Assay description: p38 MAPKγ: The enzyme inhibitory activities of compounds disclosed herein were determined by FRET using synthetic peptides labelled with both do...
Ligand InfoPC cidPC sid
In DepthDetails US Patent
TargetGlycogen synthase kinase-3 alpha(Homo sapiens (Human))
Respivert
US Patent
LigandPNGBDBM330279(1-(3-(tert-butyl)-1-(p-tolyl)-1H-pyrazol-5-yl)- 3-...)
Affinity DataIC50: >1.67E+3nM. Assay description: GSK 3α: The inhibitory activities of test compounds against the GSK 3α enzyme isoform (Invitrogen), were evaluated by determining the level...
Ligand InfoPC cidPC sid
In DepthDetails US Patent
TargetMitogen-activated protein kinase 14(Homo sapiens (Human))
Respivert
US Patent
LigandPNGBDBM330279(1-(3-(tert-butyl)-1-(p-tolyl)-1H-pyrazol-5-yl)- 3-...)
Affinity DataIC50:  33nM. Assay description: The inhibitory activities of test compounds against the p38 MAPKα isoform (MAPK14: Invitrogen), were evaluated indirectly by determining the lev...
Ligand InfoPC cidPC sid
In DepthDetails US Patent
TargetMitogen-activated protein kinase 12(Homo sapiens (Human))
Respivert
US Patent
LigandPNGBDBM330279(1-(3-(tert-butyl)-1-(p-tolyl)-1H-pyrazol-5-yl)- 3-...)
Affinity DataIC50: >1.67E+3nM. Assay description: The inhibitory activities of compounds of the invention against p38MAPKγ (MAPK12: Invitrogen), were evaluated in a similar fashion to that descr...
Ligand InfoPC cidPC sid
In DepthDetails US Patent
TargetGlycogen synthase kinase-3 alpha(Homo sapiens (Human))
Respivert
US Patent
LigandPNGBDBM330279(1-(3-(tert-butyl)-1-(p-tolyl)-1H-pyrazol-5-yl)- 3-...)
Affinity DataIC50: >1.67E+3nM. Assay description: The inhibitory activities of test compounds against the GSK 3α enzyme isoform (Invitrogen), were evaluated by determining the level of activatio...
Ligand InfoPC cidPC sid
In DepthDetails US Patent
TargetMitogen-activated protein kinase 14(Homo sapiens (Human))
Respivert
US Patent
LigandPNGBDBM330279(1-(3-(tert-butyl)-1-(p-tolyl)-1H-pyrazol-5-yl)- 3-...)
Affinity DataIC50:  33nM. Assay description: p38 MAPKα: The inhibitory activities of test compounds against the p38 MAPKα isoform (MAPK14: Invitrogen), were evaluated indirectly by det...
Ligand InfoPC cidPC sid
In DepthDetails US Patent
TargetMitogen-activated protein kinase 12(Homo sapiens (Human))
Respivert
US Patent
LigandPNGBDBM330279(1-(3-(tert-butyl)-1-(p-tolyl)-1H-pyrazol-5-yl)- 3-...)
Affinity DataIC50: >1.67E+3nM. Assay description: p38 MAPKγ: The inhibitory activities of compounds of the invention against p38MAPKγ (MAPK12: Invitrogen), were evaluated in a similar fashi...
Ligand InfoPC cidPC sid
In DepthDetails US Patent
TargetGlycogen synthase kinase-3 alpha(Homo sapiens (Human))
Respivert
US Patent
LigandPNGBDBM330279(1-(3-(tert-butyl)-1-(p-tolyl)-1H-pyrazol-5-yl)- 3-...)
Affinity DataIC50: >1.67E+3nM. Assay description: GSK 3α: The enzyme inhibitory activities of compounds disclosed herein were determined by FRET using synthetic peptides labelled with both donor...
Ligand InfoPC cidPC sid
In DepthDetails US Patent