BDBM330389 US9725436, Entry 8
SMILES CC(C)S(=O)(=O)N1CCN(CC1)c1ccc(\C=C\c2cc(Cl)cc(c2)-c2ccncc2)cc1
InChI Key InChIKey=JMAIZXLLNFXDDS-ONEGZZNKSA-N
Data  4 IC50
  Tab Delimited (TSV)   2D SDfile   Computed 3D by Vconf -m prep SDfile
Find this compound or compounds like it in BindingDB:
Activity Spreadsheet -- Enzyme Inhibition Constant Data from BindingDB
Found 4 hits for monomerid = 330389
TargetSteroid 17-alpha-hydroxylase/17,20 lyase(Bos taurus (Bovine))
Cortendo AB (PUBL)
US Patent
LigandPNGBDBM330389(US9725436, Entry 8)
Affinity DataIC50:  5nM. Assay description: Cyp17 assay protocol: AD293 cells that stably over-express recombinant CYP-17 were seeded in 96 well plates coated with poly D-lysine (15,000 cell pe...
Ligand InfoPC cidPC sid
In DepthDetails US Patent
TargetSteroid 17-alpha-hydroxylase/17,20 lyase(Homo sapiens (Human))
Temple University School Of Pharmacy
Curated by ChEMBL
LigandPNGBDBM330389(US9725436, Entry 8)
Affinity DataIC50:  5nM. Assay description: Inhibition of recombinant CYP17 (unknown origin) expressed in human AD293 cells using [21-3H]17alpha-hydroxypregnenolone as substrate preincubated fo...
Ligand InfoPC cidPC sid
In DepthDetails ArticlePubMed
TargetSteroid 17-alpha-hydroxylase/17,20 lyase(Bos taurus (Bovine))
Cortendo AB (PUBL)
US Patent
LigandPNGBDBM330389(US9725436, Entry 8)
Affinity DataIC50:  565nM. Assay description: Cyp21 assay protocol: AD293 cells that stably over-express recombinant CYP-21 were seeded in 96 well plates coated with poly D-lysine (10,000 cell pe...
Ligand InfoPC cidPC sid
In DepthDetails US Patent
TargetCholesterol side-chain cleavage enzyme, mitochondrial(Bos taurus (Bovine))
Cortendo AB (PUBL)
US Patent
LigandPNGBDBM330389(US9725436, Entry 8)
Affinity DataIC50:  58nM. Assay description: Cyp11 assay protocol: AD293 cells that stably over-express recombinant CYP-11 were seeded in 96 well plates coated with poly D-lysine (15,000 cell pe...
Ligand InfoPC cidPC sid
In DepthDetails US Patent