BDBM33129 2-(9-ketoacridin-10-yl)-N-[(3-nitro-4-pyrrolidino-benzylidene)amino]acetamide::MLS000585799::N'-[(1E)-(3-nitro-4-pyrrolidin-1-ylphenyl)methylene]-2-(9-oxoacridin-10(9H)-yl)acetohydrazide::N-[(3-nitro-4-pyrrolidin-1-yl-phenyl)methylideneamino]-2-(9-oxidanylideneacridin-10-yl)ethanamide::N-[(3-nitro-4-pyrrolidin-1-ylphenyl)methylideneamino]-2-(9-oxoacridin-10-yl)acetamide::N-[[3-nitro-4-(1-pyrrolidinyl)phenyl]methylideneamino]-2-(9-oxo-10-acridinyl)acetamide::SMR000204362::cid_4027877
SMILES [O-][N+](=O)c1cc(\C=N\NC(=O)Cn2c3ccccc3c(=O)c3ccccc23)ccc1N1CCCC1
InChI Key InChIKey=VCBBNVCMFCWCBV-JVWAILMASA-N
Data  2 IC50  2 EC50
  Tab Delimited (TSV)   2D SDfile   Computed 3D by Vconf -m prep SDfile
Find this compound or compounds like it in BindingDB:
Activity Spreadsheet -- Enzyme Inhibition Constant Data from BindingDB
Found 4 hits for monomerid = 33129
TargetBcl-2-related protein A1(Homo sapiens (Human))
Nmmlsc
Curated by PubChem BioAssay
LigandPNGBDBM33129(2-(9-ketoacridin-10-yl)-N-[(3-nitro-4-pyrrolidino-...)
Affinity DataEC50:  4.11E+4nMpH: 7.4 T: 2°C. Assay description: The multiplex is constructed by using beads for each protein target that have been labeled with varying intensities of red color, so that each assay ...
In DepthDetails PCBioAssay
TargetImportin subunit alpha-1(Homo sapiens (Human))
Broad Institute
Curated by PubChem BioAssay
LigandPNGBDBM33129(2-(9-ketoacridin-10-yl)-N-[(3-nitro-4-pyrrolidino-...)
Affinity DataEC50: >5.00E+5nM. Assay description: Keywords: Counterscreen, FRET assay, HTS, YIC probe, Dose response, Assay Overview: This is a fluorescence resonance energy transfer (FRET)-based b...
In DepthDetails PCBioAssay
TargetGlycoprotein 42(Human herpesvirus 4 type 2)
Emory University
Curated by PubChem BioAssay
LigandPNGBDBM33129(2-(9-ketoacridin-10-yl)-N-[(3-nitro-4-pyrrolidino-...)
Affinity DataIC50:  3.66E+3nM. Assay description: NIH Molecular Libraries Screening Centers Network [MLSCN] Emory Chemical Biology Discovery Center in MLSCN Assay provider: Theodore Jardetzky; Northw...
In DepthDetails PCBioAssay
TargetInduced myeloid leukemia cell differentiation protein Mcl-1(Homo sapiens (Human))
Emory University
Curated by PubChem BioAssay
LigandPNGBDBM33129(2-(9-ketoacridin-10-yl)-N-[(3-nitro-4-pyrrolidino-...)
Affinity DataIC50:  839nM. Assay description: NIH Molecular Libraries Screening Centers Network [MLSCN] Emory Chemical Biology Discovery Center in MLSCN Assay provider: Nikolovska-Coleska, Univer...
In DepthDetails PCBioAssay