BDBM33141 5-bromanyl-3-[(E)-3-(4-methoxyphenyl)prop-2-enoyl]-2-oxidanyl-cyclohepta-2,4,6-trien-1-one::5-bromo-2-hydroxy-3-[(E)-3-(4-methoxyphenyl)-1-oxoprop-2-enyl]-1-cyclohepta-2,4,6-trienone::5-bromo-2-hydroxy-3-[(E)-3-(4-methoxyphenyl)acryloyl]cyclohepta-2,4,6-trien-1-one::5-bromo-2-hydroxy-3-[(E)-3-(4-methoxyphenyl)prop-2-enoyl]cyclohepta-2,4,6-trien-1-one::5-bromo-2-hydroxy-3-[3-(4-methoxyphenyl)acryloyl]-2,4,6-cycloheptatrien-1-one::MLS000702099::SMR000229858::cid_7314662
SMILES COc1ccc(\C=C\C(=O)c2cc(Br)ccc(=O)c2O)cc1
InChI Key InChIKey=HPILVPHVPKUJFW-XBXARRHUSA-N
Data  4 EC50
  Tab Delimited (TSV)   2D SDfile   Computed 3D by Vconf -m prep SDfile
Find this compound or compounds like it in BindingDB:
Activity Spreadsheet -- Enzyme Inhibition Constant Data from BindingDB
Found 4 hits for monomerid = 33141
TargetBcl-2-related protein A1(Homo sapiens (Human))
Nmmlsc
Curated by PubChem BioAssay
LigandPNGBDBM33141(5-bromanyl-3-[(E)-3-(4-methoxyphenyl)prop-2-enoyl]...)
Affinity DataEC50:  1.41E+4nMpH: 7.4 T: 2°C. Assay description: The multiplex is constructed by using beads for each protein target that have been labeled with varying intensities of red color, so that each assay ...
In DepthDetails PCBioAssay
LigandPNGBDBM33141(5-bromanyl-3-[(E)-3-(4-methoxyphenyl)prop-2-enoyl]...)
Affinity DataEC50:  3.32E+4nM. Assay description: University of New Mexico Assay Overview: Assay Support: NIH 1X01 MH079850-01 HTS to identify small molecule regulators of Bcl-2 family protein int...
In DepthDetails PCBioAssay
TargetApoptosis regulator Bcl-2(Homo sapiens (Human))
Nmmlsc
Curated by PubChem BioAssay
LigandPNGBDBM33141(5-bromanyl-3-[(E)-3-(4-methoxyphenyl)prop-2-enoyl]...)
Affinity DataEC50:  3.36E+4nM. Assay description: University of New Mexico Assay Overview: Assay Support: NIH 1X01 MH079850-01 HTS to identify small molecule regulators of Bcl-2 family protein int...
In DepthDetails PCBioAssay
TargetBcl-2-like protein 2(Homo sapiens (Human))
Nmmlsc
Curated by PubChem BioAssay
LigandPNGBDBM33141(5-bromanyl-3-[(E)-3-(4-methoxyphenyl)prop-2-enoyl]...)
Affinity DataEC50:  2.75E+4nM. Assay description: University of New Mexico Assay Overview: Assay Support: NIH 1X01 MH079850-01 HTS to identify small molecule regulators of Bcl-2 family protein int...
In DepthDetails PCBioAssay