BDBM33156 4-[(5-benzyl-3-carbamoyl-4-methyl-2-thienyl)amino]-4-keto-butyric acid methyl ester::4-[[3-carbamoyl-4-methyl-5-(phenylmethyl)-2-thiophenyl]amino]-4-oxobutanoic acid methyl ester::MLS000708819::SMR000289386::cid_1071335::methyl 4-[(5-benzyl-3-carbamoyl-4-methylthiophen-2-yl)amino]-4-oxobutanoate::methyl 4-[[3-aminocarbonyl-4-methyl-5-(phenylmethyl)thiophen-2-yl]amino]-4-oxidanylidene-butanoate
SMILES COC(=O)CCC(=O)Nc1sc(Cc2ccccc2)c(C)c1C(N)=O
InChI Key InChIKey=SBYCSVOUQFRMNP-UHFFFAOYSA-N
Data  5 IC50  1 EC50
  Tab Delimited (TSV)   2D SDfile   Computed 3D by Vconf -m prep SDfile
Find this compound or compounds like it in BindingDB:
Activity Spreadsheet -- Enzyme Inhibition Constant Data from BindingDB
Found 6 hits for monomerid = 33156
TargetBcl-2-related protein A1(Homo sapiens (Human))
Nmmlsc
Curated by PubChem BioAssay
LigandPNGBDBM33156(4-[(5-benzyl-3-carbamoyl-4-methyl-2-thienyl)amino]...)
Affinity DataEC50:  970nMpH: 7.4 T: 2°C. Assay description: The multiplex is constructed by using beads for each protein target that have been labeled with varying intensities of red color, so that each assay ...
In DepthDetails PCBioAssay
TargetDNA dC->dU-editing enzyme APOBEC-3G(Homo sapiens (Human))
Burnham Center For Chemical Genomics
Curated by PubChem BioAssay
LigandPNGBDBM33156(4-[(5-benzyl-3-carbamoyl-4-methyl-2-thienyl)amino]...)
Affinity DataIC50:  3.11E+4nMT: 2°C. Assay description: Data Source: Sanford-Burnham Center for Chemical Genomics (SBCCG) Source Affiliation: Sanford-Burnham Medical Research Institute (SBMRI, San Diego, C...
In DepthDetails PCBioAssay
TargetGlucose-6-phosphate dehydrogenase-6-phosphogluconolactonase(Plasmodium falciparum 3D7)
Burnham Center For Chemical Genomics
Curated by PubChem BioAssay
LigandPNGBDBM33156(4-[(5-benzyl-3-carbamoyl-4-methyl-2-thienyl)amino]...)
Affinity DataIC50:  3.51E+4nM. Assay description: Data Source: Sanford-Burnham Center for Chemical Genomics (SBCCG) Source Affiliation: Sanford-Burnham Medical Research Institute (SBMRI, San Diego CA...
In DepthDetails PCBioAssay
TargetGlucose-6-phosphate dehydrogenase-6-phosphogluconolactonase(Plasmodium falciparum 3D7)
Burnham Center For Chemical Genomics
Curated by PubChem BioAssay
LigandPNGBDBM33156(4-[(5-benzyl-3-carbamoyl-4-methyl-2-thienyl)amino]...)
Affinity DataIC50:  2.06E+4nM. Assay description: Data Source: Sanford-Burnham Center for Chemical Genomics (SBCCG) Source Affiliation: Sanford-Burnham Medical Research Institute (SBMRI, San Diego CA...
In DepthDetails PCBioAssay
TargetGlucose-6-phosphate dehydrogenase-6-phosphogluconolactonase(Plasmodium falciparum 3D7)
Burnham Center For Chemical Genomics
Curated by PubChem BioAssay
LigandPNGBDBM33156(4-[(5-benzyl-3-carbamoyl-4-methyl-2-thienyl)amino]...)
Affinity DataIC50: >8.00E+4nM. Assay description: Data Source: Sanford-Burnham Center for Chemical Genomics (SBCCG) Source Affiliation: Sanford-Burnham Medical Research Institute (SBMRI, San Diego CA...
In DepthDetails PCBioAssay
TargetGlucose-6-phosphate 1-dehydrogenase(Homo sapiens (Human))
Burnham Center For Chemical Genomics
Curated by PubChem BioAssay
LigandPNGBDBM33156(4-[(5-benzyl-3-carbamoyl-4-methyl-2-thienyl)amino]...)
Affinity DataIC50: >8.00E+4nM. Assay description: Data Source: Sanford-Burnham Center for Chemical Genomics (SBCCG) Source Affiliation: Sanford-Burnham Medical Research Institute (SBMRI, San Diego CA...
In DepthDetails PCBioAssay