BDBM33186 5-[4-(dimethylamino)-3-nitro-benzylidene]barbituric acid::5-[[4-(dimethylamino)-3-nitro-phenyl]methylidene]-1,3-diazinane-2,4,6-trione::5-[[4-(dimethylamino)-3-nitrophenyl]methylidene]-1,3-diazinane-2,4,6-trione::MLS000710728::SMR000280495::cid_2840530
SMILES [#6]-[#7](-[#6])-c1ccc(\[#6]=[#6]-2/[#6](=O)-[#7]-[#6](=O)-[#7]-[#6]-2=O)cc1-[#7+](-[#8-])=O
InChI Key InChIKey=INCCZBKYRPVEAS-UHFFFAOYSA-N
Data  2 EC50
  Tab Delimited (TSV)   2D SDfile   Computed 3D by Vconf -m prep SDfile
Find this compound or compounds like it in BindingDB:
Activity Spreadsheet -- Enzyme Inhibition Constant Data from BindingDB
Found 2 hits for monomerid = 33186
TargetApoptosis regulator Bcl-2(Homo sapiens (Human))
Nmmlsc
Curated by PubChem BioAssay
LigandPNGBDBM33186(5-[4-(dimethylamino)-3-nitro-benzylidene]barbituri...)
Affinity DataEC50:  1.64E+4nM. Assay description: University of New Mexico Assay Overview: Assay Support: NIH 1X01 MH079850-01 HTS to identify small molecule regulators of Bcl-2 family protein int...
In DepthDetails PCBioAssay
TargetBcl-2-related protein A1(Homo sapiens (Human))
Nmmlsc
Curated by PubChem BioAssay
LigandPNGBDBM33186(5-[4-(dimethylamino)-3-nitro-benzylidene]barbituri...)
Affinity DataEC50:  4.67E+3nMpH: 7.4 T: 2°C. Assay description: The multiplex is constructed by using beads for each protein target that have been labeled with varying intensities of red color, so that each assay ...
In DepthDetails PCBioAssay