BDBM33192 3,4,5-trihydroxy-N'-[(1Z)-1-(4-nitrophenyl)ethylidene]benzohydrazide::3,4,5-trihydroxy-N-[(Z)-1-(4-nitrophenyl)ethylideneamino]benzamide::3,4,5-trihydroxy-N-[1-(4-nitrophenyl)ethylideneamino]benzamide::MLS000685625::N-[1-(4-nitrophenyl)ethylideneamino]-3,4,5-tris(oxidanyl)benzamide::SMR000312589::cid_4099654
SMILES CC(=NNC(=O)c1cc(O)c(O)c(O)c1)c1ccc(cc1)[N+]([O-])=O
InChI Key InChIKey=HYFNZMWEZPPLLE-UHFFFAOYSA-N
Data  4 IC50  8 EC50
  Tab Delimited (TSV)   2D SDfile   Computed 3D by Vconf -m prep SDfile
Find this compound or compounds like it in BindingDB:
Activity Spreadsheet -- Enzyme Inhibition Constant Data from BindingDB
Found 12 hits for monomerid = 33192
TargetBcl-2-related protein A1(Homo sapiens (Human))
Nmmlsc
Curated by PubChem BioAssay
LigandPNGBDBM33192(3,4,5-trihydroxy-N'-[(1Z)-1-(4-nitrophenyl)eth...)
Affinity DataEC50:  6.78E+3nMpH: 7.4 T: 2°C. Assay description: The multiplex is constructed by using beads for each protein target that have been labeled with varying intensities of red color, so that each assay ...
In DepthDetails PCBioAssay
TargetApoptosis regulator Bcl-2(Homo sapiens (Human))
Nmmlsc
Curated by PubChem BioAssay
LigandPNGBDBM33192(3,4,5-trihydroxy-N'-[(1Z)-1-(4-nitrophenyl)eth...)
Affinity DataEC50:  5.96E+3nM. Assay description: University of New Mexico Assay Overview: Assay Support: NIH 1X01 MH079850-01 HTS to identify small molecule regulators of Bcl-2 family protein int...
In DepthDetails PCBioAssay
TargetBcl-2-like protein 2(Homo sapiens (Human))
Nmmlsc
Curated by PubChem BioAssay
LigandPNGBDBM33192(3,4,5-trihydroxy-N'-[(1Z)-1-(4-nitrophenyl)eth...)
Affinity DataEC50:  4.03E+3nM. Assay description: University of New Mexico Assay Overview: Assay Support: NIH 1X01 MH079850-01 HTS to identify small molecule regulators of Bcl-2 family protein int...
In DepthDetails PCBioAssay
TargetRegulator of G-protein signaling 8(Homo sapiens (Human))
Nmmlsc
Curated by PubChem BioAssay
LigandPNGBDBM33192(3,4,5-trihydroxy-N'-[(1Z)-1-(4-nitrophenyl)eth...)
Affinity DataEC50: >3.00E+4nM. Assay description: University of New Mexico Assay Overview: Assay Support: NIH R21NS057014 HTS to identify small molecule regulators of RGS family protein interaction...
In DepthDetails PCBioAssay
TargetRegulator of G-protein signaling 7(Homo sapiens (Human))
Nmmlsc
Curated by PubChem BioAssay
LigandPNGBDBM33192(3,4,5-trihydroxy-N'-[(1Z)-1-(4-nitrophenyl)eth...)
Affinity DataEC50:  2.13E+4nM. Assay description: University of New Mexico Assay Overview: Assay Support: NIH R21NS057014 HTS to identify small molecule regulators of RGS family protein interaction...
In DepthDetails PCBioAssay
TargetPC4 and SFRS1-interacting protein(Homo sapiens (Human))
The Scripps Research Institute Molecular Screening Center
Curated by PubChem BioAssay
LigandPNGBDBM33192(3,4,5-trihydroxy-N'-[(1Z)-1-(4-nitrophenyl)eth...)
Affinity DataIC50:  2.12E+3nM. Assay description: Source (MLPCN Center Name): The Scripps Research Institute Molecular Screening Center (SRIMSC) Affiliation: Ohio State University Assay Provider: Mam...
In DepthDetails PCBioAssay
TargetRegulator of G-protein signaling 16(Homo sapiens (Human))
Nmmlsc
Curated by PubChem BioAssay
LigandPNGBDBM33192(3,4,5-trihydroxy-N'-[(1Z)-1-(4-nitrophenyl)eth...)
Affinity DataEC50:  1.95E+4nM. Assay description: University of New Mexico Assay Overview: Assay Support: NIH R21NS057014 HTS to identify small molecule regulators of RGS family protein interaction...
In DepthDetails PCBioAssay
TargetRegulator of G-protein signaling 4(Homo sapiens (Human))
Nmmlsc
Curated by PubChem BioAssay
LigandPNGBDBM33192(3,4,5-trihydroxy-N'-[(1Z)-1-(4-nitrophenyl)eth...)
Affinity DataEC50:  3.00E+4nM. Assay description: University of New Mexico Assay Overview: Assay Support: NIH R21NS057014 HTS to identify small molecule regulators of RGS family protein interaction...
In DepthDetails PCBioAssay
TargetT cell receptor alpha variable 4(Homo sapiens (Human))
The Scripps Research Institute Molecular Screening Center
Curated by PubChem BioAssay
LigandPNGBDBM33192(3,4,5-trihydroxy-N'-[(1Z)-1-(4-nitrophenyl)eth...)
Affinity DataIC50: >9.41E+4nM
In DepthDetails PCBioAssay
TargetAlbumin(Bos taurus)
The Scripps Research Institute Molecular Screening Center
Curated by PubChem BioAssay
LigandPNGBDBM33192(3,4,5-trihydroxy-N'-[(1Z)-1-(4-nitrophenyl)eth...)
Affinity DataIC50: >9.41E+4nM
In DepthDetails PCBioAssay
TargetPC4 and SFRS1-interacting protein(Homo sapiens (Human))
The Scripps Research Institute Molecular Screening Center
Curated by PubChem BioAssay
LigandPNGBDBM33192(3,4,5-trihydroxy-N'-[(1Z)-1-(4-nitrophenyl)eth...)
Affinity DataIC50:  1.41E+4nM. Assay description: Source (MLPCN Center Name): The Scripps Research Institute Molecular Screening Center (SRIMSC) Affiliation: Ohio State University Assay Provider: Mam...
In DepthDetails PCBioAssay
TargetRegulator of G-protein signaling 19(Homo sapiens (Human))
Nmmlsc
Curated by PubChem BioAssay
LigandPNGBDBM33192(3,4,5-trihydroxy-N'-[(1Z)-1-(4-nitrophenyl)eth...)
Affinity DataEC50:  2.00E+4nM. Assay description: University of New Mexico Assay Overview: Assay Support: NIH R21NS057014 HTS to identify small molecule regulators of RGS family protein interaction...
In DepthDetails PCBioAssay