BDBM33592 1-[5-[(4-fluorobenzyl)amino]-3-phenyl-1,2,4-triazol-1-yl]ethanone::1-[5-[(4-fluorophenyl)methylamino]-3-phenyl-1,2,4-triazol-1-yl]ethanone::1-acetyl-N-(4-fluorobenzyl)-3-phenyl-1H-1,2,4-triazol-5-amine::MLS000064364::SMR000076602::cid_970076
SMILES CC(=O)n1nc(nc1NCc1ccc(F)cc1)-c1ccccc1
InChI Key InChIKey=YCLZQWWIYVBQDV-UHFFFAOYSA-N
Data  1 IC50
  Tab Delimited (TSV)   2D SDfile   Computed 3D by Vconf -m prep SDfile
Find this compound or compounds like it in BindingDB:
Activity Spreadsheet -- Enzyme Inhibition Constant Data from BindingDB
Found 1 hit for monomerid = 33592
TargetProthrombin(Homo sapiens (Human))
Pcmd
Curated by PubChem BioAssay
LigandPNGBDBM33592(1-[5-[(4-fluorobenzyl)amino]-3-phenyl-1,2,4-triazo...)
Affinity DataIC50:  16.6nMpH: 7.5 T: 2°C. Assay description: HTS was performed using 217,350 compounds of the MLSCN library individually plated into 10ul 1536 compound plates at a concentration of 2.5 mM each, ...
In DepthDetails PCBioAssay