BDBM33627 (1,3-benzoxazol-2-ylthio)formic acid butyl ester::MLS000105935::SMR000102909::butyl 1,3-benzoxazol-2-ylsulfanylformate::butyl 1,3-benzoxazol-2-ylsulfanylmethanoate::cid_2202888
SMILES CCCCOC(=O)Sc1nc2ccccc2o1
InChI Key InChIKey=MJTKQBGLMBYWSU-UHFFFAOYSA-N
Data  3 IC50
  Tab Delimited (TSV)   2D SDfile   Computed 3D by Vconf -m prep SDfile
Find this compound or compounds like it in BindingDB:
Activity Spreadsheet -- Enzyme Inhibition Constant Data from BindingDB
Found 3 hits for monomerid = 33627
TargetProthrombin(Homo sapiens (Human))
Pcmd
Curated by PubChem BioAssay
LigandPNGBDBM33627((1,3-benzoxazol-2-ylthio)formic acid butyl ester |...)
Affinity DataIC50:  3.11E+3nMpH: 7.5 T: 2°C. Assay description: HTS was performed using 217,350 compounds of the MLSCN library individually plated into 10ul 1536 compound plates at a concentration of 2.5 mM each, ...
In DepthDetails PCBioAssay
TargetMacrophage migration inhibitory factor(Homo sapiens (Human))
Brain Mind Institute
Curated by ChEMBL
LigandPNGBDBM33627((1,3-benzoxazol-2-ylthio)formic acid butyl ester |...)
Affinity DataIC50:  150nM. Assay description: Inhibition of human MIF tautomerase activity in presence of Triton X-100 as detergent
In DepthDetails ArticlePubMed
TargetMacrophage migration inhibitory factor(Homo sapiens (Human))
Brain Mind Institute
Curated by ChEMBL
LigandPNGBDBM33627((1,3-benzoxazol-2-ylthio)formic acid butyl ester |...)
Affinity DataIC50:  80nM. Assay description: Inhibition of human MIF tautomerase activity
In DepthDetails ArticlePubMed