BDBM33793 1-[3-(3-pyridinyl)-5-(thiophen-2-ylmethylamino)-1,2,4-triazol-1-yl]-1-butanone::1-[3-(3-pyridyl)-5-(2-thenylamino)-1,2,4-triazol-1-yl]butan-1-one::1-[3-pyridin-3-yl-5-(thiophen-2-ylmethylamino)-1,2,4-triazol-1-yl]butan-1-one::MLS000719011::SMR000291279::cid_4011449
SMILES CCCC(=O)n1nc(nc1NCc1cccs1)-c1cccnc1
InChI Key InChIKey=XDHDMDAJMYZOHN-UHFFFAOYSA-N
Data  1 IC50
  Tab Delimited (TSV)   2D SDfile   Computed 3D by Vconf -m prep SDfile
Find this compound or compounds like it in BindingDB:
Activity Spreadsheet -- Enzyme Inhibition Constant Data from BindingDB
Found 1 hit for monomerid = 33793
TargetProthrombin(Homo sapiens (Human))
Pcmd
Curated by PubChem BioAssay
LigandPNGBDBM33793(1-[3-(3-pyridinyl)-5-(thiophen-2-ylmethylamino)-1,...)
Affinity DataIC50:  4.26nMpH: 7.5 T: 2°C. Assay description: HTS was performed using 217,350 compounds of the MLSCN library individually plated into 10ul 1536 compound plates at a concentration of 2.5 mM each, ...
In DepthDetails PCBioAssay