BDBM34184 MLS000052391::N-[1-(1-adamantyl)-1H-pyrazol-4-yl]-5-(2-furyl)-7-(trifluoromethyl)pyrazolo[1,5-a]pyrimidine-3-carboxamide::N-[1-(1-adamantyl)-4-pyrazolyl]-5-(2-furanyl)-7-(trifluoromethyl)-3-pyrazolo[1,5-a]pyrimidinecarboxamide::N-[1-(1-adamantyl)pyrazol-4-yl]-5-(2-furyl)-7-(trifluoromethyl)pyrazolo[1,5-a]pyrimidine-3-carboxamide::N-[1-(1-adamantyl)pyrazol-4-yl]-5-(furan-2-yl)-7-(trifluoromethyl)pyrazolo[1,5-a]pyrimidine-3-carboxamide::SMR000081749::cid_2976134
SMILES [H]C12CC3([H])CC([H])(C1)CC(C2)(C3)n1cc(NC(=O)c2cnn3c(cc(nc23)-c2ccco2)C(F)(F)F)cn1
InChI Key InChIKey=JROZBVPBTMTIPB-UHFFFAOYSA-N
Data  8 IC50
  Tab Delimited (TSV)   2D SDfile   Computed 3D by Vconf -m prep SDfile
Find this compound or compounds like it in BindingDB:
Activity Spreadsheet -- Enzyme Inhibition Constant Data from BindingDB
Found 8 hits for monomerid = 34184
TargetBcl-2-related protein A1(Mus musculus (Mouse))
Burnham Center For Chemical Genomics
Curated by PubChem BioAssay
LigandPNGBDBM34184(MLS000052391 | N-[1-(1-adamantyl)-1H-pyrazol-4-yl]...)
Affinity DataIC50:  1.12E+4nMpH: 7.0 T: 2°C. Assay description: The aim is to identify chemical probes of Bfl-1 through a fluorescence polarization assay (FPA) using FITC-Bid BH3 peptide. 1) Dose-response curves c...
In DepthDetails PCBioAssay
TargetBcl-2-related protein A1(Mus musculus (Mouse))
Burnham Center For Chemical Genomics
Curated by PubChem BioAssay
LigandPNGBDBM34184(MLS000052391 | N-[1-(1-adamantyl)-1H-pyrazol-4-yl]...)
Affinity DataIC50:  1.69E+3nM. Assay description: Data Source: Sanford-Burnham Center for Chemical Genomics (SBCCG) Source Affiliation: Sanford-Burnham Medical Research Institute (SBMRI, San Diego, C...
In DepthDetails PCBioAssay
TargetEstrogen receptor(Homo sapiens (Human))
Emory University
Curated by PubChem BioAssay
LigandPNGBDBM34184(MLS000052391 | N-[1-(1-adamantyl)-1H-pyrazol-4-yl]...)
Affinity DataIC50:  3.64E+3nM. Assay description: NIH Molecular Libraries Screening Centers Network [MLSCN] Emory Chemical Biology Discovery Center in MLSCN Assay provider: John A. Katzenellenbogen, ...
In DepthDetails PCBioAssay
TargetNeutrophil cytosol factor 1 [S99G](Homo sapiens (Human))
Emory University
Curated by PubChem BioAssay
LigandPNGBDBM34184(MLS000052391 | N-[1-(1-adamantyl)-1H-pyrazol-4-yl]...)
Affinity DataIC50:  5.00E+4nM. Assay description: NIH Molecular Libraries Screening Centers Network [MLSCN] Emory Chemical Biology Discovery Center in MLSCN Assay provider: Susan Smith, Emory Univers...
In DepthDetails PCBioAssay
TargetBcl-2-related protein A1(Mus musculus (Mouse))
Burnham Center For Chemical Genomics
Curated by PubChem BioAssay
LigandPNGBDBM34184(MLS000052391 | N-[1-(1-adamantyl)-1H-pyrazol-4-yl]...)
Affinity DataIC50:  1.76E+3nM. Assay description: Sanford-Burnham Center for Chemical Genomics (SBCCG) Sanford-Burnham Medical Research Institute (San Diego, CA) NIH Molecular Libraries Screening Cen...
In DepthDetails PCBioAssay
TargetEstrogen receptor beta(Homo sapiens (Human))
Emory University
Curated by PubChem BioAssay
LigandPNGBDBM34184(MLS000052391 | N-[1-(1-adamantyl)-1H-pyrazol-4-yl]...)
Affinity DataIC50:  23nM. Assay description: NIH Molecular Libraries Screening Centers Network [MLSCN] Emory Chemical Biology Discovery Center in MLSCN Assay provider: John A. Katzenellenbogen, ...
In DepthDetails PCBioAssay
TargetEstrogen receptor beta(Homo sapiens (Human))
Emory University
Curated by PubChem BioAssay
LigandPNGBDBM34184(MLS000052391 | N-[1-(1-adamantyl)-1H-pyrazol-4-yl]...)
Affinity DataIC50:  5.00E+4nM. Assay description: NIH Molecular Libraries Screening Centers Network [MLSCN] Emory Chemical Biology Discovery Center in MLSCN Assay provider: John A. Katzenellenbogen, ...
In DepthDetails PCBioAssay
TargetBcl-2-related protein A1(Mus musculus (Mouse))
Burnham Center For Chemical Genomics
Curated by PubChem BioAssay
LigandPNGBDBM34184(MLS000052391 | N-[1-(1-adamantyl)-1H-pyrazol-4-yl]...)
Affinity DataIC50:  1.23E+4nM. Assay description: Sanford-Burnham Center for Chemical Genomics (SBCCG) Sanford-Burnham Medical Research Institute (San Diego, CA) NIH Molecular Libraries Screening Cen...
In DepthDetails PCBioAssay