BDBM34191 (2-methoxyphenyl)-(3-methylsulfanyl-6,7-dihydro-[1,2,4]triazino[5,6-d][3,1]benzoxazepin-6-yl)methanone::(2-methoxyphenyl)-[3-(methylthio)-6,7-dihydro-[1,2,4]triazino[5,6-d][3,1]benzoxazepin-6-yl]methanone::MLS000111412::SMR000107336::cid_2906776
SMILES COc1ccccc1C(=O)C1Nc2ccccc2-c2nnc(SC)nc2O1
InChI Key InChIKey=SVRHZTFGWDYKCB-UHFFFAOYSA-N
Data  2 IC50  1 EC50
  Tab Delimited (TSV)   2D SDfile   Computed 3D by Vconf -m prep SDfile
Find this compound or compounds like it in BindingDB:
Activity Spreadsheet -- Enzyme Inhibition Constant Data from BindingDB
Found 3 hits for monomerid = 34191
TargetBcl-2-related protein A1(Mus musculus (Mouse))
Burnham Center For Chemical Genomics
Curated by PubChem BioAssay
LigandPNGBDBM34191((2-methoxyphenyl)-(3-methylsulfanyl-6,7-dihydro-[1...)
Affinity DataIC50:  4.79E+3nMpH: 7.0 T: 2°C. Assay description: The aim is to identify chemical probes of Bfl-1 through a fluorescence polarization assay (FPA) using FITC-Bid BH3 peptide. 1) Dose-response curves c...
In DepthDetails PCBioAssay
TargetProtein LANA1(Human herpesvirus 8)
Broad Institute
Curated by PubChem BioAssay
LigandPNGBDBM34191((2-methoxyphenyl)-(3-methylsulfanyl-6,7-dihydro-[1...)
Affinity DataEC50: >7.50E+4nM. Assay description: Primary Collaborators: Kenneth Kaye,Brigham & Womens,Boston MA,kkaye@rics.bwh.harvard.edu,617-525-4256 Chantal Beauchemin,Brigham & Womens,Boston MA,...
In DepthDetails PCBioAssay
TargetBcl-2-related protein A1(Mus musculus (Mouse))
Burnham Center For Chemical Genomics
Curated by PubChem BioAssay
LigandPNGBDBM34191((2-methoxyphenyl)-(3-methylsulfanyl-6,7-dihydro-[1...)
Affinity DataIC50:  4.60E+3nM. Assay description: Sanford-Burnham Center for Chemical Genomics (SBCCG) Sanford-Burnham Medical Research Institute (San Diego, CA) NIH Molecular Libraries Screening Cen...
In DepthDetails PCBioAssay