BDBM34221 5,7-dimethyl-2H-[1,2,4]triazolo[4,3-a]pyrimidine-3-thione::MLS000071546::SMR000009103::cid_705426
SMILES Cc1cc(C)n2c(n[nH]c2=S)n1
InChI Key InChIKey=YINCJELKAOSUAF-UHFFFAOYSA-N
Data  8 IC50
  Tab Delimited (TSV)   2D SDfile   Computed 3D by Vconf -m prep SDfile
Find this compound or compounds like it in BindingDB:
Activity Spreadsheet -- Enzyme Inhibition Constant Data from BindingDB
Found 8 hits for monomerid = 34221
TargetGag-Pol polyprotein(Human immunodeficiency virus type 1 group M subtyp...)
University Of Pittsburgh
Curated by PubChem BioAssay
LigandPNGBDBM34221(5,7-dimethyl-2H-[1,2,4]triazolo[4,3-a]pyrimidine-3...)
Affinity DataIC50:  8.10E+3nMpH: 8.0 T: 2°C. Assay description: A fluorescence resonance energy transfer assay is developed in 96-well and 384-well microplate formats with robotic manipulation to enable high-throu...
In DepthDetails PCBioAssay
TargetMannose-6-phosphate isomerase(Homo sapiens (Human))
Burnham Center For Chemical Genomics
Curated by PubChem BioAssay
LigandPNGBDBM34221(5,7-dimethyl-2H-[1,2,4]triazolo[4,3-a]pyrimidine-3...)
Affinity DataIC50: >5.00E+4nMpH: 7.4 T: 2°C. Assay description: The purpose of this assay is to identify non-competititve inhibitors of human PMI. This is accomplished by using a G6PD- NADPH-coupled assay. In the ...
In DepthDetails PCBioAssay
TargetMannose-6-phosphate isomerase(Homo sapiens (Human))
Burnham Center For Chemical Genomics
Curated by PubChem BioAssay
LigandPNGBDBM34221(5,7-dimethyl-2H-[1,2,4]triazolo[4,3-a]pyrimidine-3...)
Affinity DataIC50:  4.32E+4nM. Assay description: Data Source: Sanford-Burnham Center for Chemical Genomics (SBCCG) Source Affiliation: Sanford-Burnham Medical Research Institute (SBMRI, San Diego, C...
In DepthDetails PCBioAssay
TargetDNA dC->dU-editing enzyme APOBEC-3A(Homo sapiens (Human))
Burnham Center For Chemical Genomics
Curated by PubChem BioAssay
LigandPNGBDBM34221(5,7-dimethyl-2H-[1,2,4]triazolo[4,3-a]pyrimidine-3...)
Affinity DataIC50: >1.00E+5nMT: 2°C. Assay description: Data Source: Sanford-Burnham Center for Chemical Genomics (SBCCG) Source Affiliation: Sanford-Burnham Medical Research Institute (SBMRI, San Diego, C...
In DepthDetails PCBioAssay
TargetProcathepsin L(Homo sapiens (Human))
The Scripps Research Institute Molecular Screening Center
Curated by PubChem BioAssay
LigandPNGBDBM34221(5,7-dimethyl-2H-[1,2,4]triazolo[4,3-a]pyrimidine-3...)
Affinity DataIC50: >5.96E+4nM. Assay description: Source (MLPCN Center Name): The Scripps Research Institute Molecular Screening Center Affiliation: The Scripps Research Institute, TSRI Assay Provide...
In DepthDetails PCBioAssay
TargetNeutrophil cytosol factor 1 [S99G](Homo sapiens (Human))
Emory University
Curated by PubChem BioAssay
LigandPNGBDBM34221(5,7-dimethyl-2H-[1,2,4]triazolo[4,3-a]pyrimidine-3...)
Affinity DataIC50:  5.00E+4nM. Assay description: NIH Molecular Libraries Screening Centers Network [MLSCN] Emory Chemical Biology Discovery Center in MLSCN Assay provider: Susan Smith, Emory Univers...
In DepthDetails PCBioAssay
TargetDNA dC->dU-editing enzyme APOBEC-3G(Homo sapiens (Human))
Burnham Center For Chemical Genomics
Curated by PubChem BioAssay
LigandPNGBDBM34221(5,7-dimethyl-2H-[1,2,4]triazolo[4,3-a]pyrimidine-3...)
Affinity DataIC50:  1.70E+4nMT: 2°C. Assay description: Data Source: Sanford-Burnham Center for Chemical Genomics (SBCCG) Source Affiliation: Sanford-Burnham Medical Research Institute (SBMRI, San Diego, C...
In DepthDetails PCBioAssay
TargetM18 aspartyl aminopeptidase(Plasmodium falciparum 3D7)
The Scripps Research Institute Molecular Screening Center
Curated by PubChem BioAssay
LigandPNGBDBM34221(5,7-dimethyl-2H-[1,2,4]triazolo[4,3-a]pyrimidine-3...)
Affinity DataIC50:  6.41E+3nM. Assay description: Source (MLPCN Center Name): The Scripps Research Institute Molecular Screening Center Affiliation: The Scripps Research Institute, TSRI Assay Provide...
In DepthDetails PCBioAssay