BDBM34354 4-amino-3-(1,3-benzodioxol-5-yl)-2-sulfanylidene-5-thiazolecarboxylic acid ethyl ester::4-amino-3-(1,3-benzodioxol-5-yl)-2-thioxo-4-thiazoline-5-carboxylic acid ethyl ester::MLS000095491::SMR000031045::cid_3236739::ethyl 4-amino-3-(1,3-benzodioxol-5-yl)-2-sulfanylidene-1,3-thiazole-5-carboxylate::ethyl 4-amino-3-(1,3-benzodioxol-5-yl)-2-thioxo-2,3-dihydro-1,3-thiazole-5-carboxylate::ethyl 4-azanyl-3-(1,3-benzodioxol-5-yl)-2-sulfanylidene-1,3-thiazole-5-carboxylate
SMILES CCOC(=O)c1sc(=S)n(c1N)-c1ccc2OCOc2c1
InChI Key InChIKey=LUZQPESBLJESJR-UHFFFAOYSA-N
Data  3 IC50
  Tab Delimited (TSV)   2D SDfile   Computed 3D by Vconf -m prep SDfile
Find this compound or compounds like it in BindingDB:
Activity Spreadsheet -- Enzyme Inhibition Constant Data from BindingDB
Found 3 hits for monomerid = 34354
TargetGag-Pol polyprotein(Human immunodeficiency virus type 1 group M subtyp...)
University Of Pittsburgh
Curated by PubChem BioAssay
LigandPNGBDBM34354(4-amino-3-(1,3-benzodioxol-5-yl)-2-sulfanylidene-5...)
Affinity DataIC50:  1.02E+3nMpH: 8.0 T: 2°C. Assay description: A fluorescence resonance energy transfer assay is developed in 96-well and 384-well microplate formats with robotic manipulation to enable high-throu...
In DepthDetails PCBioAssay
TargetPolyadenylate-binding protein 1(Homo sapiens (Human))
Burnham Center For Chemical Genomics
Curated by PubChem BioAssay
LigandPNGBDBM34354(4-amino-3-(1,3-benzodioxol-5-yl)-2-sulfanylidene-5...)
Affinity DataIC50: >6.60E+4nM. Assay description: Data Source: Sanford-Burnham Center for Chemical Genomics (SBCCG) Source Affiliation: Sanford-Burnham Medical Research Institute (SBMRI, San Diego, C...
In DepthDetails PCBioAssay
TargetPolyadenylate-binding protein 1(Homo sapiens (Human))
Burnham Center For Chemical Genomics
Curated by PubChem BioAssay
LigandPNGBDBM34354(4-amino-3-(1,3-benzodioxol-5-yl)-2-sulfanylidene-5...)
Affinity DataIC50: >6.60E+4nM. Assay description: Data Source: Sanford-Burnham Center for Chemical Genomics (SBCCG) Source Affiliation: Sanford-Burnham Medical Research Institute (SBMRI, San Diego, C...
In DepthDetails PCBioAssay