BDBM34415 3-(4-tert-butylphenyl)-6-(4-pyridinyl)[1,2,4]triazolo[3,4-b][1,3,4]thiadiazole::3-(4-tert-butylphenyl)-6-(4-pyridyl)-[1,2,4]triazolo[3,4-b][1,3,4]thiadiazole::3-(4-tert-butylphenyl)-6-pyridin-4-yl-[1,2,4]triazolo[3,4-b][1,3,4]thiadiazole::MLS000064683::SMR000077449::cid_972495
SMILES CC(C)(C)c1ccc(cc1)-c1nnc2sc(nn12)-c1ccncc1
InChI Key InChIKey=JASYWCQGDVUHJZ-UHFFFAOYSA-N
Data  1 IC50  3 EC50
  Tab Delimited (TSV)   2D SDfile   Computed 3D by Vconf -m prep SDfile
Find this compound or compounds like it in BindingDB:
Activity Spreadsheet -- Enzyme Inhibition Constant Data from BindingDB
Found 4 hits for monomerid = 34415
TargetGag-Pol polyprotein(Human immunodeficiency virus type 1 group M subtyp...)
University Of Pittsburgh
Curated by PubChem BioAssay
LigandPNGBDBM34415(3-(4-tert-butylphenyl)-6-(4-pyridinyl)[1,2,4]triaz...)
Affinity DataIC50:  6.18E+3nMpH: 8.0 T: 2°C. Assay description: A fluorescence resonance energy transfer assay is developed in 96-well and 384-well microplate formats with robotic manipulation to enable high-throu...
In DepthDetails PCBioAssay
TargetNuclear receptor coactivator 1(Homo sapiens (Human))
The Scripps Research Institute Molecular Screening Center
Curated by PubChem BioAssay
LigandPNGBDBM34415(3-(4-tert-butylphenyl)-6-(4-pyridinyl)[1,2,4]triaz...)
Affinity DataEC50: >7.94E+4nM. Assay description: Source (MLSCN Center Name): The Scripps Research Institute Molecular Screening Center Center Affiliation: The Scripps Research Institute (TSRI) Assay...
In DepthDetails PCBioAssay
TargetNuclear receptor coactivator 2(Homo sapiens (Human))
The Scripps Research Institute Molecular Screening Center
Curated by PubChem BioAssay
LigandPNGBDBM34415(3-(4-tert-butylphenyl)-6-(4-pyridinyl)[1,2,4]triaz...)
Affinity DataEC50: >7.94E+4nM. Assay description: Source (MLSCN Center Name): The Scripps Research Institute Molecular Screening Center Center Affiliation: The Scripps Research Institute (TSRI) Assay...
In DepthDetails PCBioAssay
TargetNuclear receptor coactivator 3(Homo sapiens (Human))
The Scripps Research Institute Molecular Screening Center
Curated by PubChem BioAssay
LigandPNGBDBM34415(3-(4-tert-butylphenyl)-6-(4-pyridinyl)[1,2,4]triaz...)
Affinity DataEC50: >7.94E+4nM. Assay description: Source (MLSCN Center Name): The Scripps Research Institute Molecular Screening Center http://molscreen.florida.scripps.edu/ Center Affiliation: The ...
In DepthDetails PCBioAssay