BDBM34419 2,6-di-tert-butyl-4-{[4-(2-hydroxyethyl)-1-piperazinyl]carbonothioyl}phenol::2,6-ditert-butyl-4-[[4-(2-hydroxyethyl)-1-piperazinyl]-mercaptomethylidene]-1-cyclohexa-2,5-dienone::2,6-ditert-butyl-4-[[4-(2-hydroxyethyl)piperazin-1-yl]-sulfanyl-methylidene]cyclohexa-2,5-dien-1-one::2,6-ditert-butyl-4-[[4-(2-hydroxyethyl)piperazin-1-yl]-sulfanylmethylidene]cyclohexa-2,5-dien-1-one::2,6-ditert-butyl-4-[[4-(2-hydroxyethyl)piperazino]-mercapto-methylene]cyclohexa-2,5-dien-1-one::MLS000050217::SMR000077360::cid_5649484
SMILES CC(C)(C)c1cc(cc(c1O)C(C)(C)C)C(=S)N1CCN(CCO)CC1
InChI Key InChIKey=HRRJEDMATDGNGB-UHFFFAOYSA-N
Data  3 IC50  3 EC50
  Tab Delimited (TSV)   2D SDfile   Computed 3D by Vconf -m prep SDfile
Find this compound or compounds like it in BindingDB:
Activity Spreadsheet -- Enzyme Inhibition Constant Data from BindingDB
Found 6 hits for monomerid = 34419
TargetGag-Pol polyprotein(Human immunodeficiency virus type 1 group M subtyp...)
University Of Pittsburgh
Curated by PubChem BioAssay
LigandPNGBDBM34419(2,6-di-tert-butyl-4-{[4-(2-hydroxyethyl)-1-piperaz...)
Affinity DataIC50: >5.00E+4nMpH: 8.0 T: 2°C. Assay description: A fluorescence resonance energy transfer assay is developed in 96-well and 384-well microplate formats with robotic manipulation to enable high-throu...
In DepthDetails PCBioAssay
TargetNuclear receptor coactivator 3(Homo sapiens (Human))
The Scripps Research Institute Molecular Screening Center
Curated by PubChem BioAssay
LigandPNGBDBM34419(2,6-di-tert-butyl-4-{[4-(2-hydroxyethyl)-1-piperaz...)
Affinity DataEC50: >7.94E+4nM. Assay description: Source (MLSCN Center Name): The Scripps Research Institute Molecular Screening Center http://molscreen.florida.scripps.edu/ Center Affiliation: The ...
In DepthDetails PCBioAssay
TargetDNA dC->dU-editing enzyme APOBEC-3A(Homo sapiens (Human))
Burnham Center For Chemical Genomics
Curated by PubChem BioAssay
LigandPNGBDBM34419(2,6-di-tert-butyl-4-{[4-(2-hydroxyethyl)-1-piperaz...)
Affinity DataIC50: >1.00E+5nMT: 2°C. Assay description: Data Source: Sanford-Burnham Center for Chemical Genomics (SBCCG) Source Affiliation: Sanford-Burnham Medical Research Institute (SBMRI, San Diego, C...
In DepthDetails PCBioAssay
TargetNuclear receptor coactivator 1(Homo sapiens (Human))
The Scripps Research Institute Molecular Screening Center
Curated by PubChem BioAssay
LigandPNGBDBM34419(2,6-di-tert-butyl-4-{[4-(2-hydroxyethyl)-1-piperaz...)
Affinity DataEC50: >7.94E+4nM. Assay description: Source (MLSCN Center Name): The Scripps Research Institute Molecular Screening Center Center Affiliation: The Scripps Research Institute (TSRI) Assay...
In DepthDetails PCBioAssay
TargetDNA dC->dU-editing enzyme APOBEC-3G(Homo sapiens (Human))
Burnham Center For Chemical Genomics
Curated by PubChem BioAssay
LigandPNGBDBM34419(2,6-di-tert-butyl-4-{[4-(2-hydroxyethyl)-1-piperaz...)
Affinity DataIC50:  1.34E+4nMT: 2°C. Assay description: Data Source: Sanford-Burnham Center for Chemical Genomics (SBCCG) Source Affiliation: Sanford-Burnham Medical Research Institute (SBMRI, San Diego, C...
In DepthDetails PCBioAssay
TargetNuclear receptor coactivator 2(Homo sapiens (Human))
The Scripps Research Institute Molecular Screening Center
Curated by PubChem BioAssay
LigandPNGBDBM34419(2,6-di-tert-butyl-4-{[4-(2-hydroxyethyl)-1-piperaz...)
Affinity DataEC50: >7.94E+4nM. Assay description: Source (MLSCN Center Name): The Scripps Research Institute Molecular Screening Center Center Affiliation: The Scripps Research Institute (TSRI) Assay...
In DepthDetails PCBioAssay