BDBM34504 8-(5-bromanyl-2-methoxy-phenyl)-3-methyl-6-oxidanylidene-2,4,7,8-tetrahydropyrido[2,1-b][1,3,5]thiadiazine-9-carbonitrile::8-(5-bromo-2-methoxy-phenyl)-6-keto-3-methyl-2,4,7,8-tetrahydropyrido[2,1-b][1,3,5]thiadiazine-9-carbonitrile::8-(5-bromo-2-methoxyphenyl)-3-methyl-6-oxo-2,4,7,8-tetrahydropyrido[2,1-b][1,3,5]thiadiazine-9-carbonitrile::MLS000117267::SMR000094219::cid_5307839
SMILES COc1ccc(Br)cc1C1CC(=O)N2CN(C)CSC2=C1C#N
InChI Key InChIKey=ZUYQCUKTYZEMIJ-UHFFFAOYSA-N
Data  2 IC50
  Tab Delimited (TSV)   2D SDfile   Computed 3D by Vconf -m prep SDfile
Find this compound or compounds like it in BindingDB:
Activity Spreadsheet -- Enzyme Inhibition Constant Data from BindingDB
Found 2 hits for monomerid = 34504
TargetLarge T antigen(Simian virus 40)
Southern Research Specialized Biocontainment Screening Center
Curated by PubChem BioAssay
LigandPNGBDBM34504(8-(5-bromanyl-2-methoxy-phenyl)-3-methyl-6-oxidany...)
Affinity DataIC50:  7.69E+4nM. Assay description: A biochemical assay using the ADP-Hunter methodology, purified TAg, and ATP to identify compounds that inhibit the ATPase activity of Tag Southern Re...
In DepthDetails PCBioAssay
TargetGag-Pol polyprotein(Human immunodeficiency virus type 1 group M subtyp...)
University Of Pittsburgh
Curated by PubChem BioAssay
LigandPNGBDBM34504(8-(5-bromanyl-2-methoxy-phenyl)-3-methyl-6-oxidany...)
Affinity DataIC50:  7.18E+3nMpH: 8.0 T: 2°C. Assay description: A fluorescence resonance energy transfer assay is developed in 96-well and 384-well microplate formats with robotic manipulation to enable high-throu...
In DepthDetails PCBioAssay