BDBM34604 3,5,7-trimethyl-3H-[1,2,4]triazolo[1,5-a]pyrimidin-8-ium::3,5,7-trimethyl-[1,2,4]triazolo[1,5-a]pyrimidin-8-ium;iodide::MLS000047701::SMR000033710::cid_3238460
SMILES Cc1cc(C)[n+]2ncn(C)c2n1
InChI Key InChIKey=IJGGWOIMSSVDQE-UHFFFAOYSA-N
Data  1 IC50  1 EC50
  Tab Delimited (TSV)   2D SDfile   Computed 3D by Vconf -m prep SDfile
Find this compound or compounds like it in BindingDB:
Activity Spreadsheet -- Enzyme Inhibition Constant Data from BindingDB
Found 2 hits for monomerid = 34604
TargetProtein LANA1(Human herpesvirus 8)
Broad Institute
Curated by PubChem BioAssay
LigandPNGBDBM34604(3,5,7-trimethyl-3H-[1,2,4]triazolo[1,5-a]pyrimidin...)
Affinity DataEC50: >7.50E+4nM. Assay description: Primary Collaborators: Kenneth Kaye,Brigham & Womens,Boston MA,kkaye@rics.bwh.harvard.edu,617-525-4256 Chantal Beauchemin,Brigham & Womens,Boston MA,...
In DepthDetails PCBioAssay
TargetMannose-6-phosphate isomerase(Homo sapiens (Human))
Burnham Center For Chemical Genomics
Curated by PubChem BioAssay
LigandPNGBDBM34604(3,5,7-trimethyl-3H-[1,2,4]triazolo[1,5-a]pyrimidin...)
Affinity DataIC50: >5.00E+4nMpH: 7.4 T: 2°C. Assay description: The purpose of this assay is to identify non-competititve inhibitors of human PMI. This is accomplished by using a G6PD- NADPH-coupled assay. In the ...
In DepthDetails PCBioAssay