BDBM34633 5-[3,4-dihydro-1H-isoquinolin-2-yl-(4-methoxyphenyl)methyl]-2-methyl-6-thiazolo[3,2-b][1,2,4]triazolol::5-[3,4-dihydro-1H-isoquinolin-2-yl-(4-methoxyphenyl)methyl]-2-methyl-[1,3]thiazolo[3,2-b][1,2,4]triazol-6-ol::5-[3,4-dihydro-1H-isoquinolin-2-yl-(4-methoxyphenyl)methyl]-2-methyl-thiazolo[3,2-b][1,2,4]triazol-6-ol::MLS000101782::SMR000017259::cid_4113163
SMILES COc1ccc(cc1)C(N1CCc2ccccc2C1)c1sc2nc(C)nn2c1O
InChI Key InChIKey=GLLWHEFHFZTHRP-UHFFFAOYSA-N
Data  1 IC50
  Tab Delimited (TSV)   2D SDfile   Computed 3D by Vconf -m prep SDfile
Find this compound or compounds like it in BindingDB:
Activity Spreadsheet -- Enzyme Inhibition Constant Data from BindingDB
Found 1 hit for monomerid = 34633
TargetMannose-6-phosphate isomerase(Homo sapiens (Human))
Burnham Center For Chemical Genomics
Curated by PubChem BioAssay
LigandPNGBDBM34633(5-[3,4-dihydro-1H-isoquinolin-2-yl-(4-methoxypheny...)
Affinity DataIC50:  9.88E+3nMpH: 7.4 T: 2°C. Assay description: The purpose of this assay is to identify non-competititve inhibitors of human PMI. This is accomplished by using a G6PD- NADPH-coupled assay. In the ...
In DepthDetails PCBioAssay