BDBM34687 2-Amino-1-pentyl-1H-pyrrolo[2,3-b]quinoxaline-3-carboxylic acid (thiophen-2-ylmethyl)-amide::2-amino-1-amyl-N-(2-thenyl)pyrrolo[3,2-b]quinoxaline-3-carboxamide::2-amino-1-pentyl-N-(thiophen-2-ylmethyl)-3-pyrrolo[3,2-b]quinoxalinecarboxamide::2-amino-1-pentyl-N-(thiophen-2-ylmethyl)pyrrolo[3,2-b]quinoxaline-3-carboxamide::2-azanyl-1-pentyl-N-(thiophen-2-ylmethyl)pyrrolo[3,2-b]quinoxaline-3-carboxamide::MLS000557855::SMR000148571::cid_1864686
SMILES CCCCCn1c(N)c(C(=O)NCc2cccs2)c2nc3ccccc3nc12
InChI Key InChIKey=URGDMIFJKCBJNY-UHFFFAOYSA-N
Data  3 IC50
  Tab Delimited (TSV)   2D SDfile   Computed 3D by Vconf -m prep SDfile
Find this compound or compounds like it in BindingDB:
Activity Spreadsheet -- Enzyme Inhibition Constant Data from BindingDB
Found 3 hits for monomerid = 34687
TargetMannose-6-phosphate isomerase(Homo sapiens (Human))
Burnham Center For Chemical Genomics
Curated by PubChem BioAssay
LigandPNGBDBM34687(2-Amino-1-pentyl-1H-pyrrolo[2,3-b]quinoxaline-3-ca...)
Affinity DataIC50: >5.00E+4nMpH: 7.4 T: 2°C. Assay description: The purpose of this assay is to identify non-competititve inhibitors of human PMI. This is accomplished by using a G6PD- NADPH-coupled assay. In the ...
In DepthDetails PCBioAssay
TargetApoptotic protease-activating factor 1(Homo sapiens (Human))
Burnham Center For Chemical Genomics
Curated by PubChem BioAssay
LigandPNGBDBM34687(2-Amino-1-pentyl-1H-pyrrolo[2,3-b]quinoxaline-3-ca...)
Affinity DataIC50: >1.00E+5nM. Assay description: Data Source: Sanford-Burnham Center for Chemical Genomics (SBCCG) Source Affiliation: Sanford-Burnham Medical Research Institute (SBIMR, San Diego, C...
In DepthDetails PCBioAssay
TargetApoptotic protease-activating factor 1(Homo sapiens (Human))
Burnham Center For Chemical Genomics
Curated by PubChem BioAssay
LigandPNGBDBM34687(2-Amino-1-pentyl-1H-pyrrolo[2,3-b]quinoxaline-3-ca...)
Affinity DataIC50:  5.37E+4nM. Assay description: Data Source: Sanford-Burnham Center for Chemical Genomics (SBCCG) Source Affiliation: Sanford-Burnham Medical Research Institute (SBIMR, San Diego, C...
In DepthDetails PCBioAssay