BDBM34772 (4Z)-2-methoxy-4-[[(8-methoxy-4,5-dihydrobenzo[e][1,3]benzothiazol-2-yl)amino]methylene]cyclohexa-2,5-dien-1-one::(4Z)-2-methoxy-4-[[(8-methoxy-4,5-dihydrobenzo[e][1,3]benzothiazol-2-yl)amino]methylidene]-1-cyclohexa-2,5-dienone::(4Z)-2-methoxy-4-[[(8-methoxy-4,5-dihydrobenzo[e][1,3]benzothiazol-2-yl)amino]methylidene]cyclohexa-2,5-dien-1-one::2-Methoxy-4-[(8-methoxy-4,5-dihydro-naphtho[1,2-d]thiazol-2-ylimino)-methyl]-phenol::MLS000553696::SMR000172046::cid_5445833
SMILES COc1ccc2CCc3sc(N=Cc4ccc(O)c(OC)c4)nc3-c2c1
InChI Key InChIKey=UJQZNKYKJTWKJX-UHFFFAOYSA-N
Data  2 IC50
  Tab Delimited (TSV)   2D SDfile   Computed 3D by Vconf -m prep SDfile
Find this compound or compounds like it in BindingDB:
Activity Spreadsheet -- Enzyme Inhibition Constant Data from BindingDB
Found 2 hits for monomerid = 34772
TargetMannose-6-phosphate isomerase(Homo sapiens (Human))
Sanford-Burnham Center For Chemical Genomics
Curated by PubChem BioAssay
LigandPNGBDBM34772((4Z)-2-methoxy-4-[[(8-methoxy-4,5-dihydrobenzo[e][...)
Affinity DataIC50:  5.00E+4nM. Assay description: Data Source: Sanford-Burnham Center for Chemical Genomics (SBCCG) Source Affiliation: Sanford-Burnham Medical Research Institute (SBMRI, San Diego, C...
In DepthDetails PCBioAssay
TargetMannose-6-phosphate isomerase(Homo sapiens (Human))
Sanford-Burnham Center For Chemical Genomics
Curated by PubChem BioAssay
LigandPNGBDBM34772((4Z)-2-methoxy-4-[[(8-methoxy-4,5-dihydrobenzo[e][...)
Affinity DataIC50: >5.00E+4nMpH: 7.4 T: 2°C. Assay description: The purpose of this assay is to identify non-competititve inhibitors of human PMI. This is accomplished by using a G6PD- NADPH-coupled assay. In the ...
In DepthDetails PCBioAssay