BDBM34777 2-[[3-(4-bromophenyl)-3-keto-propyl]amino]acetic acid ethyl ester::2-[[3-(4-bromophenyl)-3-oxopropyl]amino]acetic acid ethyl ester::MLS000585356::SMR000204119::cid_12005153::ethyl 2-[[3-(4-bromophenyl)-3-oxidanylidene-propyl]amino]ethanoate::ethyl 2-[[3-(4-bromophenyl)-3-oxopropyl]amino]acetate::ethyl {[3-(4-bromophenyl)-3-oxopropyl]amino}acetate
SMILES CCOC(=O)CNCCC(=O)c1ccc(Br)cc1
InChI Key InChIKey=BMHLIIXMKCQOCF-UHFFFAOYSA-N
Data  2 IC50
  Tab Delimited (TSV)   2D SDfile   Computed 3D by Vconf -m prep SDfile
Find this compound or compounds like it in BindingDB:
Activity Spreadsheet -- Enzyme Inhibition Constant Data from BindingDB
Found 2 hits for monomerid = 34777
TargetMannose-6-phosphate isomerase(Homo sapiens (Human))
Sanford-Burnham Center For Chemical Genomics
Curated by PubChem BioAssay
LigandPNGBDBM34777(2-[[3-(4-bromophenyl)-3-keto-propyl]amino]acetic a...)
Affinity DataIC50:  5.00E+4nM. Assay description: Data Source: Sanford-Burnham Center for Chemical Genomics (SBCCG) Source Affiliation: Sanford-Burnham Medical Research Institute (SBMRI, San Diego, C...
In DepthDetails PCBioAssay
TargetMannose-6-phosphate isomerase(Homo sapiens (Human))
Sanford-Burnham Center For Chemical Genomics
Curated by PubChem BioAssay
LigandPNGBDBM34777(2-[[3-(4-bromophenyl)-3-keto-propyl]amino]acetic a...)
Affinity DataIC50: >5.00E+4nMpH: 7.4 T: 2°C. Assay description: The purpose of this assay is to identify non-competititve inhibitors of human PMI. This is accomplished by using a G6PD- NADPH-coupled assay. In the ...
In DepthDetails PCBioAssay