BDBM34804 (4E)-4-[(2-benzhydrylidenehydrazinyl)methylidene]-2,3-dihydroxycyclohexa-2,5-dien-1-one::(4E)-4-[(N'-benzhydrylidenehydrazino)methylene]-2,3-dihydroxy-cyclohexa-2,5-dien-1-one::(4E)-4-[[2-(diphenylmethylene)hydrazinyl]methylidene]-2,3-dihydroxy-1-cyclohexa-2,5-dienone::(4E)-4-[[2-(diphenylmethylidene)hydrazinyl]methylidene]-2,3-bis(oxidanyl)cyclohexa-2,5-dien-1-one::MLS000395029::SMR000248458::cid_5811786
SMILES [#8]-c1ccc(-[#6]=[#7]\[#7]=[#6](/c2ccccc2)-c2ccccc2)c(-[#8])c1-[#8]
InChI Key InChIKey=YBAIWUIPYQTZEG-UHFFFAOYSA-N
Data  11 IC50
  Tab Delimited (TSV)   2D SDfile   Computed 3D by Vconf -m prep SDfile
Find this compound or compounds like it in BindingDB:
Activity Spreadsheet -- Enzyme Inhibition Constant Data from BindingDB
Found 11 hits for monomerid = 34804
TargetMannose-6-phosphate isomerase(Homo sapiens (Human))
Burnham Center For Chemical Genomics
Curated by PubChem BioAssay
LigandPNGBDBM34804((4E)-4-[(2-benzhydrylidenehydrazinyl)methylidene]-...)
Affinity DataIC50:  1.21E+4nMpH: 7.4 T: 2°C. Assay description: The purpose of this assay is to identify non-competititve inhibitors of human PMI. This is accomplished by using a G6PD- NADPH-coupled assay. In the ...
In DepthDetails PCBioAssay
TargetEukaryotic translation initiation factor 4 gamma 1(Homo sapiens (Human))
Emory University
Curated by PubChem BioAssay
LigandPNGBDBM34804((4E)-4-[(2-benzhydrylidenehydrazinyl)methylidene]-...)
Affinity DataIC50:  6.40E+4nM. Assay description: Dose Response Confirmation for Small Molecule Inhibitors of Eukaryotic Translation Initiation NIH Molecular Libraries Screening Centers Network [MLSC...
In DepthDetails PCBioAssay
TargetInduced myeloid leukemia cell differentiation protein Mcl-1(Homo sapiens (Human))
Emory University
Curated by PubChem BioAssay
LigandPNGBDBM34804((4E)-4-[(2-benzhydrylidenehydrazinyl)methylidene]-...)
Affinity DataIC50:  4.44E+3nM. Assay description: NIH Molecular Libraries Screening Centers Network [MLSCN] Emory Chemical Biology Discovery Center in MLSCN Assay provider: Nikolovska-Coleska, Univer...
In DepthDetails PCBioAssay
TargetAmyloid-beta A4 precursor protein-binding family A member 1(Rattus norvegicus)
Burnham Center For Chemical Genomics
Curated by PubChem BioAssay
LigandPNGBDBM34804((4E)-4-[(2-benzhydrylidenehydrazinyl)methylidene]-...)
Affinity DataIC50:  3.27E+3nM. Assay description: Data Source: Sanford-Burnham Center for Chemical Genomics (SBCCG) Source Affiliation: Sanford-Burnham Medical Research Institute (SBMRI, San Diego, C...
In DepthDetails PCBioAssay
TargetVoltage-dependent N-type calcium channel subunit alpha-1B(Homo sapiens (Human))
Burnham Center For Chemical Genomics
Curated by PubChem BioAssay
LigandPNGBDBM34804((4E)-4-[(2-benzhydrylidenehydrazinyl)methylidene]-...)
Affinity DataIC50:  1.08E+4nM. Assay description: Data Source: Data Source: Sanford-Burnham Center for Chemical Genomics (SBCCG) Source Affiliation: Sanford-Burnham Medical Research Institute Network...
In DepthDetails PCBioAssay
TargetPC4 and SFRS1-interacting protein(Homo sapiens (Human))
The Scripps Research Institute Molecular Screening Center
Curated by PubChem BioAssay
LigandPNGBDBM34804((4E)-4-[(2-benzhydrylidenehydrazinyl)methylidene]-...)
Affinity DataIC50:  1.08E+3nM. Assay description: Source (MLPCN Center Name): The Scripps Research Institute Molecular Screening Center (SRIMSC) Affiliation: Ohio State University Assay Provider: Mam...
In DepthDetails PCBioAssay
TargetGlucose-6-phosphate dehydrogenase-6-phosphogluconolactonase(Plasmodium falciparum 3D7)
Burnham Center For Chemical Genomics
Curated by PubChem BioAssay
LigandPNGBDBM34804((4E)-4-[(2-benzhydrylidenehydrazinyl)methylidene]-...)
Affinity DataIC50:  1.36E+4nM. Assay description: Data Source: Sanford-Burnham Center for Chemical Genomics (SBCCG) Source Affiliation: Sanford-Burnham Medical Research Institute (SBMRI, San Diego CA...
In DepthDetails PCBioAssay
TargetGlucose-6-phosphate dehydrogenase-6-phosphogluconolactonase(Plasmodium falciparum 3D7)
Burnham Center For Chemical Genomics
Curated by PubChem BioAssay
LigandPNGBDBM34804((4E)-4-[(2-benzhydrylidenehydrazinyl)methylidene]-...)
Affinity DataIC50:  6.74E+4nM. Assay description: Data Source: Sanford-Burnham Center for Chemical Genomics (SBCCG) Source Affiliation: Sanford-Burnham Medical Research Institute (SBMRI, San Diego CA...
In DepthDetails PCBioAssay
TargetGlucose-6-phosphate dehydrogenase-6-phosphogluconolactonase(Plasmodium falciparum 3D7)
Burnham Center For Chemical Genomics
Curated by PubChem BioAssay
LigandPNGBDBM34804((4E)-4-[(2-benzhydrylidenehydrazinyl)methylidene]-...)
Affinity DataIC50:  5.46E+4nM. Assay description: Data Source: Sanford-Burnham Center for Chemical Genomics (SBCCG) Source Affiliation: Sanford-Burnham Medical Research Institute (SBMRI, San Diego CA...
In DepthDetails PCBioAssay
TargetPC4 and SFRS1-interacting protein(Homo sapiens (Human))
The Scripps Research Institute Molecular Screening Center
Curated by PubChem BioAssay
LigandPNGBDBM34804((4E)-4-[(2-benzhydrylidenehydrazinyl)methylidene]-...)
Affinity DataIC50:  5.97E+3nM. Assay description: Source (MLPCN Center Name): The Scripps Research Institute Molecular Screening Center (SRIMSC) Affiliation: Ohio State University Assay Provider: Mam...
In DepthDetails PCBioAssay
TargetGlucose-6-phosphate 1-dehydrogenase(Homo sapiens (Human))
Burnham Center For Chemical Genomics
Curated by PubChem BioAssay
LigandPNGBDBM34804((4E)-4-[(2-benzhydrylidenehydrazinyl)methylidene]-...)
Affinity DataIC50:  7.92E+4nM. Assay description: Data Source: Sanford-Burnham Center for Chemical Genomics (SBCCG) Source Affiliation: Sanford-Burnham Medical Research Institute (SBMRI, San Diego CA...
In DepthDetails PCBioAssay