BDBM34827 2-(2,5-dinitro-3-thienyl)pyrimidine::2-(2,5-dinitro-3-thiophenyl)pyrimidine::2-(2,5-dinitrothiophen-3-yl)pyrimidine::2-{2,5-bisnitro-3-thienyl}pyrimidine::MLS000700336::SMR000226688::cid_3319616
SMILES [O-][N+](=O)c1cc(c(s1)[N+]([O-])=O)-c1ncccn1
InChI Key InChIKey=JHHSYNZURGGRBL-UHFFFAOYSA-N
Data  6 IC50  2 EC50
  Tab Delimited (TSV)   2D SDfile   Computed 3D by Vconf -m prep SDfile
Find this compound or compounds like it in BindingDB:
Activity Spreadsheet -- Enzyme Inhibition Constant Data from BindingDB
Found 8 hits for monomerid = 34827
TargetMannose-6-phosphate isomerase(Homo sapiens (Human))
Burnham Center For Chemical Genomics
Curated by PubChem BioAssay
LigandPNGBDBM34827(2-(2,5-dinitro-3-thienyl)pyrimidine | 2-(2,5-dinit...)
Affinity DataIC50:  7.48E+3nMpH: 7.4 T: 2°C. Assay description: The purpose of this assay is to identify non-competititve inhibitors of human PMI. This is accomplished by using a G6PD- NADPH-coupled assay. In the ...
Ligand InfoPC cidPC sid
In DepthDetails PCBioAssay
TargetGalanin receptor type 2(Homo sapiens (Human))
The Scripps Research Institute Molecular Screening Center
Curated by PubChem BioAssay
LigandPNGBDBM34827(2-(2,5-dinitro-3-thienyl)pyrimidine | 2-(2,5-dinit...)
Affinity DataIC50:  8.96E+3nM. Assay description: Source (MLSCN Center Name): The Scripps Research Institute Molecular Screening Center Affiliation: The Scripps Florida Research Institute, TSRI Assay...
Ligand InfoPC cidPC sid
In DepthDetails PCBioAssay
TargetGalanin receptor type 2(Homo sapiens (Human))
The Scripps Research Institute Molecular Screening Center
Curated by PubChem BioAssay
LigandPNGBDBM34827(2-(2,5-dinitro-3-thienyl)pyrimidine | 2-(2,5-dinit...)
Affinity DataIC50:  9.61E+3nM. Assay description: Source (MLSCN Center Name): The Scripps Research Institute Molecular Screening Center Affiliation: The Scripps Research Institute (TSRI) Assay Provid...
Ligand InfoPC cidPC sid
In DepthDetails PCBioAssay
TargetC-C chemokine receptor type 6(Homo sapiens (Human))
Burnham Center For Chemical Genomics
Curated by PubChem BioAssay
LigandPNGBDBM34827(2-(2,5-dinitro-3-thienyl)pyrimidine | 2-(2,5-dinit...)
Affinity DataIC50:  2.40E+4nM. Assay description: Data Source: Sanford-Burnham Center for Chemical Genomics (SBCCG) Source Affiliation: Sanford-Burnham Medical Research Institute(SBMRI, San Diego, CA...
Ligand InfoPC cidPC sid
In DepthDetails PCBioAssay
TargetMannose-6-phosphate isomerase(Homo sapiens (Human))
Burnham Center For Chemical Genomics
Curated by PubChem BioAssay
LigandPNGBDBM34827(2-(2,5-dinitro-3-thienyl)pyrimidine | 2-(2,5-dinit...)
Affinity DataIC50:  6.92E+3nM. Assay description: Data Source: Sanford-Burnham Center for Chemical Genomics (SBCCG) Source Affiliation: Sanford-Burnham Medical Research Institute (SBMRI, San Diego, C...
Ligand InfoPC cidPC sid
In DepthDetails PCBioAssay
TargetHeat shock factor protein 1(Mus musculus)
Broad Institute
Curated by PubChem BioAssay
LigandPNGBDBM34827(2-(2,5-dinitro-3-thienyl)pyrimidine | 2-(2,5-dinit...)
Affinity DataEC50:  6.64E+3nM. Assay description: Keywords: Heat Shock Factor-1 (HSF-1), Stress Response, MG132, NIH3T3, Luminescence Assay Overview: Confirmation testing of small molecules identifie...
Ligand InfoPC cidPC sid
In DepthDetails PCBioAssay
TargetBeta-galactosidase(Escherichia coli)
Burnham Center For Chemical Genomics
Curated by PubChem BioAssay
LigandPNGBDBM34827(2-(2,5-dinitro-3-thienyl)pyrimidine | 2-(2,5-dinit...)
Affinity DataIC50: >6.66E+4nM. Assay description: Data Source: Sanford-Burnham Center for Chemical Genomics (SBCCG) Source Affiliation: Sanford-Burnham Medical Research Institute(SBMRI, San Diego, C...
Ligand InfoPC cidPC sid
In DepthDetails PCBioAssay
TargetGlutathione S-transferase Mu 1(Homo sapiens (Human))
Nmmlsc
Curated by PubChem BioAssay
LigandPNGBDBM34827(2-(2,5-dinitro-3-thienyl)pyrimidine | 2-(2,5-dinit...)
Affinity DataEC50:  7.57E+3nM. Assay description: University of New Mexico Assay Overview: Assay Support: NIH I RO3 MH081231-01 HTS to identify specific small molecule inhibitors of Ras and Ras-re...
Ligand InfoPC cidPC sid
In DepthDetails PCBioAssay