BDBM34949 4-amino-3-[(4-methoxyphenoxy)methyl]-1H-1,2,4-triazole-5-thione::4-azanyl-3-[(4-methoxyphenoxy)methyl]-1H-1,2,4-triazole-5-thione::MLS001004942::SMR000348507::cid_2374148
SMILES COc1ccc(OCc2n[nH]c(=S)n2N)cc1
InChI Key InChIKey=KJLSUWJYBZBVIJ-UHFFFAOYSA-N
Data  3 IC50
  Tab Delimited (TSV)   2D SDfile   Computed 3D by Vconf -m prep SDfile
Find this compound or compounds like it in BindingDB:
Activity Spreadsheet -- Enzyme Inhibition Constant Data from BindingDB
Found 3 hits for monomerid = 34949
TargetMannose-6-phosphate isomerase(Homo sapiens (Human))
Burnham Center For Chemical Genomics
Curated by PubChem BioAssay
LigandPNGBDBM34949(4-amino-3-[(4-methoxyphenoxy)methyl]-1H-1,2,4-tria...)
Affinity DataIC50:  2.14E+4nMpH: 7.4 T: 2°C. Assay description: The purpose of this assay is to identify non-competititve inhibitors of human PMI. This is accomplished by using a G6PD- NADPH-coupled assay. In the ...
In DepthDetails PCBioAssay
TargetDNA dC->dU-editing enzyme APOBEC-3A(Homo sapiens (Human))
Burnham Center For Chemical Genomics
Curated by PubChem BioAssay
LigandPNGBDBM34949(4-amino-3-[(4-methoxyphenoxy)methyl]-1H-1,2,4-tria...)
Affinity DataIC50: >1.00E+5nMT: 2°C. Assay description: Data Source: Sanford-Burnham Center for Chemical Genomics (SBCCG) Source Affiliation: Sanford-Burnham Medical Research Institute (SBMRI, San Diego, C...
In DepthDetails PCBioAssay
TargetDNA dC->dU-editing enzyme APOBEC-3G(Homo sapiens (Human))
Burnham Center For Chemical Genomics
Curated by PubChem BioAssay
LigandPNGBDBM34949(4-amino-3-[(4-methoxyphenoxy)methyl]-1H-1,2,4-tria...)
Affinity DataIC50:  7.10E+3nMT: 2°C. Assay description: Data Source: Sanford-Burnham Center for Chemical Genomics (SBCCG) Source Affiliation: Sanford-Burnham Medical Research Institute (SBMRI, San Diego, C...
In DepthDetails PCBioAssay