BDBM349969 (S)-5-(4-(3-(4-chlorobenzyl)-2,3-dihydrobenzo[f][1,4]oxazepin-4(5H)-yl)piperidin-1-yl)-4H-1,2,4-triazol-3-amine ::US10208020, Example 59::US10538508, Example 59::US9944624, Ex. 59
SMILES Nc1nnc([nH]1)N1CCC(CC1)N1Cc2ccccc2OC[C@@H]1Cc1ccc(Cl)cc1
InChI Key
Data  6 IC50
  Tab Delimited (TSV)   2D SDfile   Computed 3D by Vconf -m prep SDfile
Find this compound or compounds like it in BindingDB:
Activity Spreadsheet -- Enzyme Inhibition Constant Data from BindingDB
Found 6 hits for monomerid = 349969
TargetAcidic mammalian chitinase(Homo sapiens (Human))
Oncoarendi Therapeutics
US Patent
LigandPNGBDBM349969((S)-5-(4-(3-(4-chlorobenzyl)-2,3-dihydrobenzo[f][1...)
Affinity DataIC50: <100nM. Assay description: An enzymatic assay with recombinant human AMCase was used in order to establish inhibitory activity of the compounds (Boot et al., 2001, JBC: 276). T...
Ligand InfoPC cidPC sid
In DepthDetails US Patent
TargetChitotriosidase-1(Homo sapiens (Human))
Oncoarendi Therapeutics
US Patent
LigandPNGBDBM349969((S)-5-(4-(3-(4-chlorobenzyl)-2,3-dihydrobenzo[f][1...)
Affinity DataIC50:  550nM. Assay description: An enzymatic assay with recombinant human CHIT1 was used in order to establish inhibitory activity of the compounds (Boot et al., 2001, JBC: 276). Th...
Ligand InfoPC cidPC sid
In DepthDetails US Patent
TargetChitotriosidase-1(Homo sapiens (Human))
Oncoarendi Therapeutics
US Patent
LigandPNGBDBM349969((S)-5-(4-(3-(4-chlorobenzyl)-2,3-dihydrobenzo[f][1...)
Affinity DataIC50:  550nM. Assay description: An enzymatic assay with recombinant human CHIT1 was used in order to establish inhibitory activity of the compounds (Boot et al., 2001, JBC: 276). Th...
Ligand InfoPC cidPC sid
In DepthDetails US Patent
TargetChitotriosidase-1(Homo sapiens (Human))
Oncoarendi Therapeutics
US Patent
LigandPNGBDBM349969((S)-5-(4-(3-(4-chlorobenzyl)-2,3-dihydrobenzo[f][1...)
Affinity DataIC50:  550nM. Assay description: An enzymatic assay with recombinant human CHIT1 was used in order to establish inhibitory activity of the compounds (Boot et al., 2001, JBC: 276). Th...
Ligand InfoPC cidPC sid
In DepthDetails US Patent
TargetAcidic mammalian chitinase(Homo sapiens (Human))
Oncoarendi Therapeutics
US Patent
LigandPNGBDBM349969((S)-5-(4-(3-(4-chlorobenzyl)-2,3-dihydrobenzo[f][1...)
Affinity DataIC50: <100nM. Assay description: An enzymatic assay with recombinant human AMCase was used in order to establish inhibitory activity of the compounds (Boot et al., 2001, JBC: 276). T...
Ligand InfoPC cidPC sid
In DepthDetails US Patent
TargetAcidic mammalian chitinase(Homo sapiens (Human))
Oncoarendi Therapeutics
US Patent
LigandPNGBDBM349969((S)-5-(4-(3-(4-chlorobenzyl)-2,3-dihydrobenzo[f][1...)
Affinity DataIC50: <100nM. Assay description: An enzymatic assay with recombinant human AMCase was used in order to establish inhibitory activity of the compounds (Boot et al., 2001, JBC: 276). T...
Ligand InfoPC cidPC sid
In DepthDetails US Patent