BDBM349970 (S)-5-(4-(3-(4-chlorobenzyl)-7-fluoro-2,3-dihydrobenzo[f][1,4]oxazepin-4(5H)-yl)piperidin-1-yl)-4H-1,2,4-triazol-3-amine ::US10208020, Example 60::US10538508, Example 60::US11638707, Example C19.::US9944624, Ex. 60
SMILES Nc1nnc([nH]1)N1CCC(CC1)N1Cc2cc(F)ccc2OC[C@@H]1Cc1ccc(Cl)cc1
InChI Key
Data  7 IC50
  Tab Delimited (TSV)   2D SDfile   Computed 3D by Vconf -m prep SDfile
Find this compound or compounds like it in BindingDB:
Activity Spreadsheet -- Enzyme Inhibition Constant Data from BindingDB
Found 7 hits for monomerid = 349970
TargetAcidic mammalian chitinase(Homo sapiens (Human))
Oncoarendi Therapeutics
US Patent
LigandPNGBDBM349970((S)-5-(4-(3-(4-chlorobenzyl)-7-fluoro-2,3-dihydrob...)
Affinity DataIC50: <100nM. Assay description: An enzymatic assay with recombinant human AMCase was used in order to establish inhibitory activity of the compounds (Boot et al., 2001, JBC: 276). T...
Ligand InfoPC cidPC sid
In DepthDetails US Patent
TargetChitotriosidase-1(Homo sapiens (Human))
Oncoarendi Therapeutics
US Patent
LigandPNGBDBM349970((S)-5-(4-(3-(4-chlorobenzyl)-7-fluoro-2,3-dihydrob...)
Affinity DataIC50:  550nM. Assay description: An enzymatic assay with recombinant human CHIT1 was used in order to establish inhibitory activity of the compounds (Boot et al., 2001, JBC: 276). Th...
Ligand InfoPC cidPC sid
In DepthDetails US Patent
TargetAcidic mammalian chitinase(Homo sapiens (Human))
Oncoarendi Therapeutics
US Patent
LigandPNGBDBM349970((S)-5-(4-(3-(4-chlorobenzyl)-7-fluoro-2,3-dihydrob...)
Affinity DataIC50: <100nM. Assay description: An enzymatic assay with recombinant human AMCase was used in order to establish inhibitory activity of the compounds (Boot et al., 2001, JBC: 276). T...
Ligand InfoPC cidPC sid
In DepthDetails US Patent
TargetPotassium voltage-gated channel subfamily H member 2(Homo sapiens (Human))
Molecure
US Patent
LigandPNGBDBM349970((S)-5-(4-(3-(4-chlorobenzyl)-7-fluoro-2,3-dihydrob...)
Affinity DataIC50:  1.75E+4nM. Assay description: Fluorescence polarization assay based on the principle of fluorescence polarization where a red-shifted fluorescent tracer is displaced from the hERG...
Ligand InfoPC cidPC sid
In DepthDetails US Patent
TargetAcidic mammalian chitinase(Homo sapiens (Human))
Oncoarendi Therapeutics
US Patent
LigandPNGBDBM349970((S)-5-(4-(3-(4-chlorobenzyl)-7-fluoro-2,3-dihydrob...)
Affinity DataIC50: <100nM. Assay description: An enzymatic assay with recombinant human AMCase was used in order to establish inhibitory activity of the compounds (Boot et al., 2001, JBC: 276). T...
Ligand InfoPC cidPC sid
In DepthDetails US Patent
TargetChitotriosidase-1(Homo sapiens (Human))
Oncoarendi Therapeutics
US Patent
LigandPNGBDBM349970((S)-5-(4-(3-(4-chlorobenzyl)-7-fluoro-2,3-dihydrob...)
Affinity DataIC50:  550nM. Assay description: An enzymatic assay with recombinant human CHIT1 was used in order to establish inhibitory activity of the compounds (Boot et al., 2001, JBC: 276). Th...
Ligand InfoPC cidPC sid
In DepthDetails US Patent
TargetChitotriosidase-1(Homo sapiens (Human))
Oncoarendi Therapeutics
US Patent
LigandPNGBDBM349970((S)-5-(4-(3-(4-chlorobenzyl)-7-fluoro-2,3-dihydrob...)
Affinity DataIC50:  550nM. Assay description: An enzymatic assay with recombinant human CHIT1 was used in order to establish inhibitory activity of the compounds (Boot et al., 2001, JBC: 276). Th...
Ligand InfoPC cidPC sid
In DepthDetails US Patent