BDBM350510 2-({[(3,4- dimethoxyphenyl)amino]carbonyl} amino)-3-phenylpropanoic acid::US10208071, Table 1.7::US10434112, Table 1.7::US10799518, Structure TABLE 1.7
SMILES COc1ccc(NC(=O)NC(Cc2ccccc2)C(O)=O)cc1OC
InChI Key InChIKey=ISENOEPGABALTE-UHFFFAOYSA-N
Data  3 EC50
  Tab Delimited (TSV)   2D SDfile   Computed 3D by Vconf -m prep SDfile
Find this compound or compounds like it in BindingDB:
Activity Spreadsheet -- Enzyme Inhibition Constant Data from BindingDB
Found 3 hits for monomerid = 350510
TargetN-formyl peptide receptor 2(Homo sapiens (Human))
Allergan
US Patent
LigandPNGBDBM350510(2-({[(3,4- dimethoxyphenyl)amino]carbonyl} amino)-...)
Affinity DataEC50:  2.79E+6nM. Assay description: HEK-Gα16 cells stably expressing the human FPR2 receptor was utilized. Cells were plated into 384-well poly-D-lysine coated plates at a density ...
Ligand InfoPC cidPC sid
In DepthDetails US Patent
TargetN-formyl peptide receptor 2(Homo sapiens (Human))
Allergan
US Patent
LigandPNGBDBM350510(2-({[(3,4- dimethoxyphenyl)amino]carbonyl} amino)-...)
Affinity DataEC50:  2.79E+3nM. Assay description: HEK-Gα16 cells stably expressing the human FPR2 receptor was utilized. Cells were plated into 384-well poly-D-lysine coated plates at a density ...
Ligand InfoPC cidPC sid
In DepthDetails US Patent
TargetN-formyl peptide receptor 2(Homo sapiens (Human))
Allergan
US Patent
LigandPNGBDBM350510(2-({[(3,4- dimethoxyphenyl)amino]carbonyl} amino)-...)
Affinity DataEC50:  2.79E+3nM. Assay description: HEK-Gα16 cells stably expressing the human FPR2 receptor was utilized. Cells were plated into 384-well poly-D-lysine coated plates at a density ...
Ligand InfoPC cidPC sid
In DepthDetails US Patent