BDBM350558 3-[(4-iodophenyl)carbamoyl]- 7-(propan-2- ylidene)bicyclo[2.2.1]hept-5- ene-2-carboxylic acid::US10208071, Compound 20::US10434112, Compound 20::US10799518, Compound 20
SMILES [#6]\[#6](-[#6])=[#6]-1/[#6]-2-[#6]=[#6]-[#6]-1-[#6](-[#6]2-[#6](-[#8])=O)-[#6](=O)-[#7]-c1ccc(I)cc1
InChI Key InChIKey=KYGFFUZNIBXZQD-UHFFFAOYSA-N
Data  3 EC50
  Tab Delimited (TSV)   2D SDfile   Computed 3D by Vconf -m prep SDfile
Find this compound or compounds like it in BindingDB:
Activity Spreadsheet -- Enzyme Inhibition Constant Data from BindingDB
Found 3 hits for monomerid = 350558
TargetN-formyl peptide receptor 2(Homo sapiens (Human))
Allergan
US Patent
LigandPNGBDBM350558(3-[(4-iodophenyl)carbamoyl]- 7-(propan-2- ylidene)...)
Affinity DataEC50:  1.10E+4nM. Assay description: HEK-Gα16 cells stably expressing the human FPR2 receptor was utilized. Cells were plated into 384-well poly-D-lysine coated plates at a density ...
Ligand InfoPC cidPC sid
In DepthDetails US Patent
TargetN-formyl peptide receptor 2(Homo sapiens (Human))
Allergan
US Patent
LigandPNGBDBM350558(3-[(4-iodophenyl)carbamoyl]- 7-(propan-2- ylidene)...)
Affinity DataEC50:  11nM. Assay description: HEK-Gα16 cells stably expressing the human FPR2 receptor was utilized. Cells were plated into 384-well poly-D-lysine coated plates at a density ...
Ligand InfoPC cidPC sid
In DepthDetails US Patent
TargetN-formyl peptide receptor 2(Homo sapiens (Human))
Allergan
US Patent
LigandPNGBDBM350558(3-[(4-iodophenyl)carbamoyl]- 7-(propan-2- ylidene)...)
Affinity DataEC50:  11nM. Assay description: HEK-Gα16 cells stably expressing the human FPR2 receptor was utilized. Cells were plated into 384-well poly-D-lysine coated plates at a density ...
Ligand InfoPC cidPC sid
In DepthDetails US Patent