BDBM350593 US10208071, Compound 55::US10434112, Compound 55::US10799518, Compound 55::{[(2S)-2-{[(4- bromophenyl)carbamoyl]amino}-3- phenylpropanoyl]amino}acetic acid
SMILES OC(=O)CNC(=O)[C@H](Cc1ccccc1)NC(=O)Nc1ccc(Br)cc1
InChI Key InChIKey=VKACGCIFXOGMSV-HNNXBMFYSA-N
Data  3 EC50
  Tab Delimited (TSV)   2D SDfile   Computed 3D by Vconf -m prep SDfile
Find this compound or compounds like it in BindingDB:
Activity Spreadsheet -- Enzyme Inhibition Constant Data from BindingDB
Found 3 hits for monomerid = 350593
TargetN-formyl peptide receptor 2(Homo sapiens (Human))
Allergan
US Patent
LigandPNGBDBM350593(US10208071, Compound 55 | US10434112, Compound 55 ...)
Affinity DataEC50:  7.70E+3nM. Assay description: HEK-Gα16 cells stably expressing the human FPR2 receptor was utilized. Cells were plated into 384-well poly-D-lysine coated plates at a density ...
Ligand InfoPC cidPC sid
In DepthDetails US Patent
TargetN-formyl peptide receptor 2(Homo sapiens (Human))
Allergan
US Patent
LigandPNGBDBM350593(US10208071, Compound 55 | US10434112, Compound 55 ...)
Affinity DataEC50:  7.70nM. Assay description: HEK-Gα16 cells stably expressing the human FPR2 receptor was utilized. Cells were plated into 384-well poly-D-lysine coated plates at a density ...
Ligand InfoPC cidPC sid
In DepthDetails US Patent
TargetN-formyl peptide receptor 2(Homo sapiens (Human))
Allergan
US Patent
LigandPNGBDBM350593(US10208071, Compound 55 | US10434112, Compound 55 ...)
Affinity DataEC50:  7.70nM. Assay description: HEK-Gα16 cells stably expressing the human FPR2 receptor was utilized. Cells were plated into 384-well poly-D-lysine coated plates at a density ...
Ligand InfoPC cidPC sid
In DepthDetails US Patent