BDBM350633 (2S)-2-{[(4- bromophenyl)carbamoyl]amino}- N-(2,3-dihydroxypropyl)- 4-methylpentanamide::US10208071, Compound 95::US10799518, Compound 95
SMILES CC(C)C[C@H](NC(=O)Nc1ccc(Br)cc1)C(=O)NCC(O)CO
InChI Key InChIKey=MEHDWYDBOQKHNL-KZUDCZAMSA-N
Data  2 EC50
  Tab Delimited (TSV)   2D SDfile   Computed 3D by Vconf -m prep SDfile
Find this compound or compounds like it in BindingDB:
Activity Spreadsheet -- Enzyme Inhibition Constant Data from BindingDB
Found 2 hits for monomerid = 350633
TargetN-formyl peptide receptor 2(Homo sapiens (Human))
Allergan
US Patent
LigandPNGBDBM350633((2S)-2-{[(4- bromophenyl)carbamoyl]amino}- N-(2,3-...)
Affinity DataEC50:  5.10nM. Assay description: HEK-Gα16 cells stably expressing the human FPR2 receptor was utilized. Cells were plated into 384-well poly-D-lysine coated plates at a density ...
Ligand InfoPC cidPC sid
In DepthDetails US Patent
TargetN-formyl peptide receptor 2(Homo sapiens (Human))
Allergan
US Patent
LigandPNGBDBM350633((2S)-2-{[(4- bromophenyl)carbamoyl]amino}- N-(2,3-...)
Affinity DataEC50:  5.10E+3nM. Assay description: HEK-Gα16 cells stably expressing the human FPR2 receptor was utilized. Cells were plated into 384-well poly-D-lysine coated plates at a density ...
Ligand InfoPC cidPC sid
In DepthDetails US Patent