BDBM350637 1-(4-bromophenyl)-3-{4-[2-(3- fluoro-4- hydroxyphenyl)ethyl]-4- methyl-2,5-dioxoimidazolidin- 1-yl}urea::US10208071, Compound 99::US10434112, Compound 99::US10799518, Compound 99
SMILES CC1(CCc2ccc(O)c(F)c2)NC(=O)N(NC(=O)Nc2ccc(Br)cc2)C1=O
InChI Key InChIKey=LAICXIUZNXHCAS-UHFFFAOYSA-N
Data  3 EC50
  Tab Delimited (TSV)   2D SDfile   Computed 3D by Vconf -m prep SDfile
Find this compound or compounds like it in BindingDB:
Activity Spreadsheet -- Enzyme Inhibition Constant Data from BindingDB
Found 3 hits for monomerid = 350637
TargetN-formyl peptide receptor 2(Homo sapiens (Human))
Allergan
US Patent
LigandPNGBDBM350637(1-(4-bromophenyl)-3-{4-[2-(3- fluoro-4- hydroxyphe...)
Affinity DataEC50:  8.00E+3nM. Assay description: HEK-Gα16 cells stably expressing the human FPR2 receptor was utilized. Cells were plated into 384-well poly-D-lysine coated plates at a density ...
Ligand InfoPC cidPC sid
In DepthDetails US Patent
TargetN-formyl peptide receptor 2(Homo sapiens (Human))
Allergan
US Patent
LigandPNGBDBM350637(1-(4-bromophenyl)-3-{4-[2-(3- fluoro-4- hydroxyphe...)
Affinity DataEC50:  8nM. Assay description: HEK-Gα16 cells stably expressing the human FPR2 receptor was utilized. Cells were plated into 384-well poly-D-lysine coated plates at a density ...
Ligand InfoPC cidPC sid
In DepthDetails US Patent
TargetN-formyl peptide receptor 2(Homo sapiens (Human))
Allergan
US Patent
LigandPNGBDBM350637(1-(4-bromophenyl)-3-{4-[2-(3- fluoro-4- hydroxyphe...)
Affinity DataEC50:  8nM. Assay description: HEK-Gα16 cells stably expressing the human FPR2 receptor was utilized. Cells were plated into 384-well poly-D-lysine coated plates at a density ...
Ligand InfoPC cidPC sid
In DepthDetails US Patent