BDBM350638 US10208071, Compound 100::US10434112, Compound 100::US10799518, Compound 100::tert-butyl (2S)-2-{[(2S)-2-{[(4- bromophenyl)carbamoyl]amino}- 4-methylpentanoyl]amino} pentanoate
SMILES CCC[C@H](NC(=O)[C@H](CC(C)C)NC(=O)Nc1ccc(Br)cc1)C(=O)OC(C)(C)C
InChI Key InChIKey=PQECWSRQAOCYDI-ROUUACIJSA-N
Data  3 EC50
  Tab Delimited (TSV)   2D SDfile   Computed 3D by Vconf -m prep SDfile
Find this compound or compounds like it in BindingDB:
Activity Spreadsheet -- Enzyme Inhibition Constant Data from BindingDB
Found 3 hits for monomerid = 350638
TargetN-formyl peptide receptor 2(Homo sapiens (Human))
Allergan
US Patent
LigandPNGBDBM350638(US10208071, Compound 100 | US10434112, Compound 10...)
Affinity DataEC50:  1.30E+4nM. Assay description: HEK-Gα16 cells stably expressing the human FPR2 receptor was utilized. Cells were plated into 384-well poly-D-lysine coated plates at a density ...
Ligand InfoPC cidPC sid
In DepthDetails US Patent
TargetN-formyl peptide receptor 2(Homo sapiens (Human))
Allergan
US Patent
LigandPNGBDBM350638(US10208071, Compound 100 | US10434112, Compound 10...)
Affinity DataEC50:  13nM. Assay description: HEK-Gα16 cells stably expressing the human FPR2 receptor was utilized. Cells were plated into 384-well poly-D-lysine coated plates at a density ...
Ligand InfoPC cidPC sid
In DepthDetails US Patent
TargetN-formyl peptide receptor 2(Homo sapiens (Human))
Allergan
US Patent
LigandPNGBDBM350638(US10208071, Compound 100 | US10434112, Compound 10...)
Affinity DataEC50:  13nM. Assay description: HEK-Gα16 cells stably expressing the human FPR2 receptor was utilized. Cells were plated into 384-well poly-D-lysine coated plates at a density ...
Ligand InfoPC cidPC sid
In DepthDetails US Patent