BDBM350651 (2-{[(4- bromophenyl)carbamoyl]amino}- 2-ethylbutanoyl)amino]acetic acid::US10208071, Compound 113::US10434112, Compound 113::US10799518, Compound 113
SMILES CCC(CC)(NC(=O)Nc1ccc(Br)cc1)C(=O)NCC(O)=O
InChI Key InChIKey=DABXKTZCTUPXLJ-UHFFFAOYSA-N
Data  3 EC50
  Tab Delimited (TSV)   2D SDfile   Computed 3D by Vconf -m prep SDfile
Find this compound or compounds like it in BindingDB:
Activity Spreadsheet -- Enzyme Inhibition Constant Data from BindingDB
Found 3 hits for monomerid = 350651
TargetN-formyl peptide receptor 2(Homo sapiens (Human))
Allergan
US Patent
LigandPNGBDBM350651((2-{[(4- bromophenyl)carbamoyl]amino}- 2-ethylbuta...)
Affinity DataEC50:  1.87E+4nM. Assay description: HEK-Gα16 cells stably expressing the human FPR2 receptor was utilized. Cells were plated into 384-well poly-D-lysine coated plates at a density ...
Ligand InfoPC cidPC sid
In DepthDetails US Patent
TargetN-formyl peptide receptor 2(Homo sapiens (Human))
Allergan
US Patent
LigandPNGBDBM350651((2-{[(4- bromophenyl)carbamoyl]amino}- 2-ethylbuta...)
Affinity DataEC50:  18.7nM. Assay description: HEK-Gα16 cells stably expressing the human FPR2 receptor was utilized. Cells were plated into 384-well poly-D-lysine coated plates at a density ...
Ligand InfoPC cidPC sid
In DepthDetails US Patent
TargetN-formyl peptide receptor 2(Homo sapiens (Human))
Allergan
US Patent
LigandPNGBDBM350651((2-{[(4- bromophenyl)carbamoyl]amino}- 2-ethylbuta...)
Affinity DataEC50:  18.7nM. Assay description: HEK-Gα16 cells stably expressing the human FPR2 receptor was utilized. Cells were plated into 384-well poly-D-lysine coated plates at a density ...
Ligand InfoPC cidPC sid
In DepthDetails US Patent