BDBM354220 (2S,4R)-1-(2-(5-(2- acetamidopyrimidin-5- yl)-3-acetyl-1H-indol- 1-yl)acetyl)-N-(6- bromopyridin-2-yl)-4- fluoropyrrolidine-2- carboxamide::US10287301, Compound 118::US10822352, Comp No. 118::US9796741, cmp No. 118
SMILES CC(=O)Nc1ncc(cn1)-c1ccc2n(CC(=O)N3C[C@H](F)C[C@H]3C(=O)Nc3cccc(Br)n3)cc(C(C)=O)c2c1
InChI Key InChIKey=UWJAWFUXNVXXEN-XXBNENTESA-N
Data  3 IC50
  Tab Delimited (TSV)   2D SDfile   Computed 3D by Vconf -m prep SDfile
Find this compound or compounds like it in BindingDB:
Activity Spreadsheet -- Enzyme Inhibition Constant Data from BindingDB
Found 3 hits for monomerid = 354220
TargetComplement factor D(Homo sapiens (Human))
Achillion Pharmaceuticals
US Patent
LigandPNGBDBM354220((2S,4R)-1-(2-(5-(2- acetamidopyrimidin-5- yl)-3-ac...)
Affinity DataIC50: <1.00E+3nM. Assay description: Human factor D (purified from human serum, Complement Technology, Inc.) at 80 nM final concentration is incubated with test compound at various conce...
Ligand InfoPC cidPC sid
In DepthDetails US Patent
TargetComplement factor D(Homo sapiens (Human))
Achillion Pharmaceuticals
US Patent
LigandPNGBDBM354220((2S,4R)-1-(2-(5-(2- acetamidopyrimidin-5- yl)-3-ac...)
Affinity DataIC50: <1.00E+3nM. Assay description: Human Factor D (purified from human serum, Complement Technology, Inc.) at 80 nM final concentration was incubated with test compound at various conc...
Ligand InfoPC cidPC sid
In DepthDetails US Patent
TargetComplement factor D(Homo sapiens (Human))
Achillion Pharmaceuticals
US Patent
LigandPNGBDBM354220((2S,4R)-1-(2-(5-(2- acetamidopyrimidin-5- yl)-3-ac...)
Affinity DataIC50: <1.00E+3nM. Assay description: Human Factor D (purified from human serum, Complement Technology, Inc.) at 80 nM final concentration was incubated with test compound at various conc...
Ligand InfoPC cidPC sid
In DepthDetails US Patent