BDBM35434 MLS000109219::N-(4-bromophenyl)-1-(4-pyridyl)methanimine oxide::N-(4-bromophenyl)-1-pyridin-4-yl-methanimine oxide::N-(4-bromophenyl)-1-pyridin-4-ylmethanimine oxide::SMR000105164::cid_877224
SMILES [O-]\[N+](=C/c1ccncc1)c1ccc(Br)cc1
InChI Key InChIKey=HSTOCXAKRBJINP-DHDCSXOGSA-N
Data  2 IC50
  Tab Delimited (TSV)   2D SDfile   Computed 3D by Vconf -m prep SDfile
Find this compound or compounds like it in BindingDB:
Activity Spreadsheet -- Enzyme Inhibition Constant Data from BindingDB
Found 2 hits for monomerid = 35434
TargetDual specificity protein phosphatase 6(Rattus norvegicus)
University Of Pittsburgh
Curated by PubChem BioAssay
LigandPNGBDBM35434(MLS000109219 | N-(4-bromophenyl)-1-(4-pyridyl)meth...)
Affinity DataIC50: >5.00E+4nM. Assay description: The in vitro MKP-3 Phosphatase dose response hit/probe assessment assay has been developed and run at the University of Pittsburgh Molecular Screenin...
In DepthDetails PCBioAssay
TargetDual specificity protein phosphatase 1(Homo sapiens (Human))
University Of Pittsburgh
Curated by PubChem BioAssay
LigandPNGBDBM35434(MLS000109219 | N-(4-bromophenyl)-1-(4-pyridyl)meth...)
Affinity DataIC50: >5.00E+4nMpH: 7.0 T: 2°C. Assay description: The MKP-1 HTS confirmation dose response assay has been developed to confirm actives identified in the MH-76391 In vitro HTS assay for MKP-1 inhibito...
In DepthDetails PCBioAssay