BDBM35447 (phenylmethyl)urea::1-(phenylmethyl)urea::CC-PMLSC-DMA-P105::benzylurea::cid_10853
SMILES NC(=O)NCc1ccccc1
InChI Key InChIKey=RJNJWHFSKNJCTB-UHFFFAOYSA-N
Data  1 IC50
  Tab Delimited (TSV)   2D SDfile   Computed 3D by Vconf -m prep SDfile
Find this compound or compounds like it in BindingDB:
Activity Spreadsheet -- Enzyme Inhibition Constant Data from BindingDB
Found 1 hit for monomerid = 35447
TargetDual specificity protein phosphatase 1(Homo sapiens (Human))
Cc_Pmlsc
Curated by PubChem BioAssay
LigandPNGBDBM35447((phenylmethyl)urea | 1-(phenylmethyl)urea | CC-PML...)
Affinity DataIC50: >5.00E+4nMpH: 7.0 T: 2°C. Assay description: The MKP-1 dose response assay SAR support Assay - has been developed to test the activity of a series Analog compounds synthesized by the PMLSC Chemi...
In DepthDetails PCBioAssay