BDBM35487 2-thiophenecarboxylic acid [2-oxo-1-(2-pyridinyl)-2-(thiophen-2-ylmethylamino)ethyl] ester::MLS000075019::SMR000008036::Thiophene-2-carboxylic acid pyridin-2-yl-[(thiophen-2-ylmethyl)-carbamoyl]-methyl ester::[2-oxidanylidene-1-pyridin-2-yl-2-(thiophen-2-ylmethylamino)ethyl] thiophene-2-carboxylate::[2-oxo-1-pyridin-2-yl-2-(thiophen-2-ylmethylamino)ethyl] thiophene-2-carboxylate::cid_648315::thiophene-2-carboxylic acid [2-keto-1-(2-pyridyl)-2-(2-thenylamino)ethyl] ester
SMILES O=C(NCc1cccs1)C(OC(=O)c1cccs1)c1ccccn1
InChI Key InChIKey=NXUIFHSRMPTITA-UHFFFAOYSA-N
Data  3 IC50
  Tab Delimited (TSV)   2D SDfile   Computed 3D by Vconf -m prep SDfile
Find this compound or compounds like it in BindingDB:
Activity Spreadsheet -- Enzyme Inhibition Constant Data from BindingDB
Found 3 hits for monomerid = 35487
TargetCathepsin B(Homo sapiens (Human))
Pcmd
Curated by PubChem BioAssay
LigandPNGBDBM35487(2-thiophenecarboxylic acid [2-oxo-1-(2-pyridinyl)-...)
Affinity DataIC50:  6.36E+3nMpH: 6.8 T: 2°C. Assay description: Screening Center: Penn Center for Molecular Discovery Center Affiliation: University of Pennsylvania Network: Molecular Library Screening Center Netw...
In DepthDetails PCBioAssay
TargetProcathepsin L(Homo sapiens (Human))
Pcmd
Curated by PubChem BioAssay
LigandPNGBDBM35487(2-thiophenecarboxylic acid [2-oxo-1-(2-pyridinyl)-...)
Affinity DataIC50: >5.00E+4nM. Assay description: Screening Center: Penn Center for Molecular Discovery Center Affiliation: University of Pennsylvania Network: Molecular Library Screening Center Netw...
In DepthDetails PCBioAssay
TargetCathepsin B(Homo sapiens (Human))
Pcmd
Curated by PubChem BioAssay
LigandPNGBDBM35487(2-thiophenecarboxylic acid [2-oxo-1-(2-pyridinyl)-...)
Affinity DataIC50:  6.36E+3nM. Assay description: Screening Center: Penn Center for Molecular Discovery Center Affiliation: University of Pennsylvania Network: Molecular Library Screening Center Netw...
In DepthDetails PCBioAssay