BDBM35499 (2-oxidanylidene-1,2-diphenyl-ethyl) 2-(furan-2-ylcarbonylamino)ethanoate::(2-oxo-1,2-diphenylethyl) 2-(furan-2-carbonylamino)acetate::2-(2-furoylamino)acetic acid desyl ester::2-[[2-furanyl(oxo)methyl]amino]acetic acid (2-oxo-1,2-diphenylethyl) ester::MLS000096499::SMR000062349::cid_2997975
SMILES O=C(CNC(=O)c1ccco1)OC(C(=O)c1ccccc1)c1ccccc1
InChI Key InChIKey=GIOLMPVSCOFDMW-UHFFFAOYSA-N
Data  3 IC50
  Tab Delimited (TSV)   2D SDfile   Computed 3D by Vconf -m prep SDfile
Find this compound or compounds like it in BindingDB:
Activity Spreadsheet -- Enzyme Inhibition Constant Data from BindingDB
Found 3 hits for monomerid = 35499
TargetCathepsin B(Homo sapiens (Human))
Pcmd
Curated by PubChem BioAssay
LigandPNGBDBM35499((2-oxidanylidene-1,2-diphenyl-ethyl) 2-(furan-2-yl...)
Affinity DataIC50:  1.90E+4nMpH: 6.8 T: 2°C. Assay description: Screening Center: Penn Center for Molecular Discovery Center Affiliation: University of Pennsylvania Network: Molecular Library Screening Center Netw...
In DepthDetails PCBioAssay
TargetProcathepsin L(Homo sapiens (Human))
Pcmd
Curated by PubChem BioAssay
LigandPNGBDBM35499((2-oxidanylidene-1,2-diphenyl-ethyl) 2-(furan-2-yl...)
Affinity DataIC50:  440nM. Assay description: Screening Center: Penn Center for Molecular Discovery Center Affiliation: University of Pennsylvania Network: Molecular Library Screening Center Netw...
In DepthDetails PCBioAssay
TargetProcathepsin L(Homo sapiens (Human))
Pcmd
Curated by PubChem BioAssay
LigandPNGBDBM35499((2-oxidanylidene-1,2-diphenyl-ethyl) 2-(furan-2-yl...)
Affinity DataIC50:  1.35E+3nM. Assay description: Screening Center: Penn Center for Molecular Discovery Center Affiliation: University of Pennsylvania Network: Molecular Library Screening Center Netw...
In DepthDetails PCBioAssay