BDBM356557 N-[3-(7-{1-[1-(3-Cyclopropylpropanoyl)piperidin-4-yl]-1H-pyrazol-4-yl}imidazo[1,2-b]pyridazin-3-yl)phenyl]-N′-(2,2,2-trifluoroethyl)urea::US10213427, Example 46::US10813930, Ex. No. 46
SMILES FC(F)(F)CNC(=O)Nc1cccc(c1)-c1cnc2cc(cnn12)-c1cnn(c1)C1CCN(CC1)C(=O)CCC1CC1
InChI Key InChIKey=CKTUIPZZGUNQDN-UHFFFAOYSA-N
Data  2 IC50
  Tab Delimited (TSV)   2D SDfile   Computed 3D by Vconf -m prep SDfile
Find this compound or compounds like it in BindingDB:
Activity Spreadsheet -- Enzyme Inhibition Constant Data from BindingDB
Found 2 hits for monomerid = 356557
TargetFibroblast growth factor receptor 3(Homo sapiens (Human))
Incyte
US Patent
LigandPNGBDBM356557(N-[3-(7-{1-[1-(3-Cyclopropylpropanoyl)piperidin-4-...)
Affinity DataIC50: <10nM. Assay description: FGFR3 Enzymatic Assay The inhibitor potency of compounds of the invention was measured in an enzyme assay that measures peptide phosphorylation using...
Ligand InfoPC cidPC sid
In DepthDetails US Patent
TargetFibroblast growth factor receptor 3(Homo sapiens (Human))
Incyte
US Patent
LigandPNGBDBM356557(N-[3-(7-{1-[1-(3-Cyclopropylpropanoyl)piperidin-4-...)
Affinity DataIC50: <10nM. Assay description: The inhibitor potency of compounds of the invention was measured in an enzyme assay that measures peptide phosphorylation using FRET measurements to ...
Ligand InfoPC cidPC sid
In DepthDetails US Patent