BDBM361585 2-((1H-pyrrolo[2,3-b]pyridin-5-yl)oxy)-4-(4- ((6-(4-chlorophenyl)spiro[3.5]non-6-en-7- yl)methyl)piperazin-1-yl)-N-((2-isopropyl-7- nitro-1H-benzo[d]imidazol-5- yl)sulfonyl)benzamide::US10221174, Compound 58::US10829488, Compound 58::US11718613, Compound 58
SMILES CC(C)c1nc2cc(cc([N+]([O-])=O)c2[nH]1)S(=O)(=O)NC(=O)c1ccc(cc1Oc1cnc2[nH]ccc2c1)N1CCN(CC2=C(CC3(CCC3)CC2)c2ccc(Cl)cc2)CC1
InChI Key InChIKey=AXESFHQRSKLGNZ-UHFFFAOYSA-N
Data  6 IC50
  Tab Delimited (TSV)   2D SDfile   Computed 3D by Vconf -m prep SDfile
Find this compound or compounds like it in BindingDB:
Activity Spreadsheet -- Enzyme Inhibition Constant Data from BindingDB
Found 6 hits for monomerid = 361585
TargetApoptosis regulator Bcl-2(Homo sapiens (Human))
The Regents Of The University Of Michigan
US Patent
LigandPNGBDBM361585(2-((1H-pyrrolo[2,3-b]pyridin-5-yl)oxy)-4-(4- ((6-(...)
Affinity DataIC50:  3.80nM. Assay description: Fluorescein labeled BIM (81-106), BAK (72-87), and BID (79-99) peptides, named as Flu-BIM, Flu-BAK, and Flu-BID, respectively, were used as the fluor...
Ligand InfoPC cidPC sid
In DepthDetails US Patent
TargetIsoform Bcl-X(L) of Bcl-2-like protein 1 (Bcl-xL)(Homo sapiens (Human))
The Regents Of The University Of Michigan
US Patent
LigandPNGBDBM361585(2-((1H-pyrrolo[2,3-b]pyridin-5-yl)oxy)-4-(4- ((6-(...)
Affinity DataIC50:  19.2nM
Ligand InfoPC cidPC sid
In DepthDetails US Patent
TargetBcl-2-like protein 1(Homo sapiens (Human))
The Regents Of The University Of Michigan
US Patent
LigandPNGBDBM361585(2-((1H-pyrrolo[2,3-b]pyridin-5-yl)oxy)-4-(4- ((6-(...)
Affinity DataIC50:  19.2nM. Assay description: Fluorescein labeled BIM (81-106), BAK (72-87), and BID (79-99) peptides, named as Flu-BIM, Flu-BAK, and Flu-BID, respectively, were used as the fluor...
Ligand InfoPC cidPC sid
In DepthDetails US Patent
TargetBcl-2-like protein 11 [81-106](Homo sapiens (Human))
The Regents Of The University Of Michigan
US Patent
LigandPNGBDBM361585(2-((1H-pyrrolo[2,3-b]pyridin-5-yl)oxy)-4-(4- ((6-(...)
Affinity DataIC50:  19.2nM. Assay description: Bcl-2 and Bcl-xL Inhibition: Fluorescein labeled BIM (81-106), BAK (72-87), and BID (79-99) peptides, named as Flu-BIM, Flu-BAK, and Flu-BID, respect...
Ligand InfoPC cidPC sid
In DepthDetails US Patent
TargetApoptosis regulator Bcl-2(Homo sapiens (Human))
The Regents Of The University Of Michigan
US Patent
LigandPNGBDBM361585(2-((1H-pyrrolo[2,3-b]pyridin-5-yl)oxy)-4-(4- ((6-(...)
Affinity DataIC50:  3.80nM. Assay description: Fluorescein labeled BIM (81-106), BAK (72-87), and BID (79-99) peptides, named as Flu-BIM, Flu-BAK, and Flu-BID, respectively, were used as the fluor...
Ligand InfoPC cidPC sid
In DepthDetails US Patent
TargetBcl-2-like protein 11 [72-87](Homo sapiens (Human))
The Regents Of The University Of Michigan
US Patent
LigandPNGBDBM361585(2-((1H-pyrrolo[2,3-b]pyridin-5-yl)oxy)-4-(4- ((6-(...)
Affinity DataIC50:  3.80nM. Assay description: Bcl-2 and Bcl-xL Inhibition: Fluorescein labeled BIM (81-106), BAK (72-87), and BID (79-99) peptides, named as Flu-BIM, Flu-BAK, and Flu-BID, respect...
Ligand InfoPC cidPC sid
In DepthDetails US Patent