BDBM364218 US9856263, 1::US9856263, 2::US9856263, 3
SMILES Cc1cc(Oc2nccn3cccc23)ccc1-c1c(C)ncc2nccn12
InChI Key InChIKey=PKHJCJGDHMFRAL-UHFFFAOYSA-N
Data  3 KI  4 EC50
  Tab Delimited (TSV)   2D SDfile   Computed 3D by Vconf -m prep SDfile
Find this compound or compounds like it in BindingDB:
Activity Spreadsheet -- Enzyme Inhibition Constant Data from BindingDB
Found 7 hits for monomerid = 364218
TargetD(1A) dopamine receptor(Homo sapiens (Human))
Pfizer
US Patent
LigandPNGBDBM364218(US9856263, 1 | US9856263, 2 | US9856263, 3)
Affinity DataKi:  4.5nM. Assay description: Frozen cells were quickly thawed, re-suspended in 50 mL warm media and allowed to sit for 5 min prior to centrifugation (1000 rpm) at room temperatur...
Ligand InfoPC cidPC sid
In DepthDetails US Patent
TargetD(1A) dopamine receptor(Homo sapiens (Human))
Pfizer
US Patent
LigandPNGBDBM364218(US9856263, 1 | US9856263, 2 | US9856263, 3)
Affinity DataKi:  5.5nM. Assay description: Frozen cells were quickly thawed, re-suspended in 50 mL warm media and allowed to sit for 5 min prior to centrifugation (1000 rpm) at room temperatur...
Ligand InfoPC cidPC sid
In DepthDetails US Patent
TargetD(1A) dopamine receptor(Homo sapiens (Human))
Pfizer
US Patent
LigandPNGBDBM364218(US9856263, 1 | US9856263, 2 | US9856263, 3)
Affinity DataKi:  20.5nM. Assay description: Frozen cells were quickly thawed, re-suspended in 50 mL warm media and allowed to sit for 5 min prior to centrifugation (1000 rpm) at room temperatur...
Ligand InfoPC cidPC sid
In DepthDetails US Patent
TargetD(1A) dopamine receptor(Homo sapiens (Human))
Pfizer
US Patent
LigandPNGBDBM364218(US9856263, 1 | US9856263, 2 | US9856263, 3)
Affinity DataEC50:  0.871nM. Assay description: Agonist activity at recombinant human D1 receptor expressed in HEK29T cells assessed as induction of stimulatory G-protein-mediated cAMP accumulation...
Ligand InfoPC cidPC sid
In DepthDetails ArticlePubMed
TargetD(1A) dopamine receptor(Homo sapiens (Human))
Pfizer
US Patent
LigandPNGBDBM364218(US9856263, 1 | US9856263, 2 | US9856263, 3)
Affinity DataEC50:  0.870nM. Assay description: Agonist activity at recombinant human D1 receptor expressed in HEK29T cells assessed as induction of stimulatory G-protein-mediated cAMP accumulation...
Ligand InfoPC cidPC sid
In DepthDetails ArticlePubMed
TargetD(1A) dopamine receptor(Homo sapiens (Human))
Pfizer
US Patent
LigandPNGBDBM364218(US9856263, 1 | US9856263, 2 | US9856263, 3)
Affinity DataEC50:  692nM. Assay description: Agonist activity at recombinant C-terminal RLuc8-fused human D1 receptor expressed in HEK29T cells co-expressing N-terminal Venus-tagged beta-arresti...
Ligand InfoPC cidPC sid
In DepthDetails ArticlePubMed
TargetD(1A) dopamine receptor(Homo sapiens (Human))
Pfizer
US Patent
LigandPNGBDBM364218(US9856263, 1 | US9856263, 2 | US9856263, 3)
Affinity DataEC50:  690nM. Assay description: Agonist activity at recombinant C-terminal RLuc8-fused human D1 receptor expressed in HEK29T cells co-expressing N-terminal Venus-tagged beta-arresti...
Ligand InfoPC cidPC sid
In DepthDetails ArticlePubMed