BDBM365112 4-(3-(3,4-difluorobenzyl)-3,4- dihydro-5-oxa-1,2,2a1- triazaacenaphthylen-7-yl)-N- (1-methyl-1H-pyrazol-5- yl)pyridin-2-amine::US10517878, Compound I-54::US10842799, I-54::US9867833, Compound I-54(S)
SMILES Cn1nccc1Nc1cc(ccn1)-c1cc2OCC(Cc3ccc(F)c(F)c3)c3nnc(c1)n23
InChI Key InChIKey=PYDBGLJLPSFVOL-UHFFFAOYSA-N
Data  3 IC50
  Tab Delimited (TSV)   2D SDfile   Computed 3D by Vconf -m prep SDfile
Find this compound or compounds like it in BindingDB:
Activity Spreadsheet -- Enzyme Inhibition Constant Data from BindingDB
Found 3 hits for monomerid = 365112
TargetMitogen-activated protein kinase 1(Homo sapiens (Human))
Genentech
US Patent
LigandPNGBDBM365112(4-(3-(3,4-difluorobenzyl)-3,4- dihydro-5-oxa-1,2,2...)
Affinity DataIC50:  22.3nM. Assay description: Compounds were tested in an enzymatic assay using human ERK-2 (Mitogen Activated Kinase 1), recombinantly expressed as an n-terminal 6-His fusion pro...
Ligand InfoPC cidPC sid
In DepthDetails US Patent
TargetMitogen-activated protein kinase 1(Homo sapiens (Human))
Genentech
US Patent
LigandPNGBDBM365112(4-(3-(3,4-difluorobenzyl)-3,4- dihydro-5-oxa-1,2,2...)
Affinity DataIC50:  0.0300nM. Assay description: Compounds were tested in an enzymatic assay using human ERK-2 (Mitogen Activated Kinase 1), recombinantly expressed as an n-terminal 6-His fusion pro...
Ligand InfoPC cidPC sid
In DepthDetails US Patent
TargetMitogen-activated protein kinase 1(Homo sapiens (Human))
Genentech
US Patent
LigandPNGBDBM365112(4-(3-(3,4-difluorobenzyl)-3,4- dihydro-5-oxa-1,2,2...)
Affinity DataIC50:  0.0300nM. Assay description: Compounds were tested in an enzymatic assay using human ERK-2 (Mitogen Activated Kinase 1), recombinantly expressed as an n-terminal 6-His fusion pro...
Ligand InfoPC cidPC sid
In DepthDetails US Patent