BDBM365128 9-(4-methoxybenzyl)-6- methyl-4-(2-((1-methyl- 1H-pyrazol-5- yl)amino)pyrimidin-4-yl)- 8,9-dihydro-1,2,2a1,6- tetraazabenzo[cd]azulen- 7(6H)-one::US10517878, Compound I-62::US10842799, I-62::US9867833, Compound I-62(S)
SMILES COc1ccc(CC2CC(=O)N(C)c3cc(cc4nnc2n34)-c2ccnc(Nc3ccnn3C)n2)cc1
InChI Key InChIKey=HWMUOSSXNXZKMN-UHFFFAOYSA-N
Data  3 IC50
  Tab Delimited (TSV)   2D SDfile   Computed 3D by Vconf -m prep SDfile
Find this compound or compounds like it in BindingDB:
Activity Spreadsheet -- Enzyme Inhibition Constant Data from BindingDB
Found 3 hits for monomerid = 365128
TargetMitogen-activated protein kinase 1(Homo sapiens (Human))
Genentech
US Patent
LigandPNGBDBM365128(9-(4-methoxybenzyl)-6- methyl-4-(2-((1-methyl- 1H-...)
Affinity DataIC50:  44nM. Assay description: Compounds were tested in an enzymatic assay using human ERK-2 (Mitogen Activated Kinase 1), recombinantly expressed as an n-terminal 6-His fusion pro...
Ligand InfoPC cidPC sid
In DepthDetails US Patent
TargetMitogen-activated protein kinase 1(Homo sapiens (Human))
Genentech
US Patent
LigandPNGBDBM365128(9-(4-methoxybenzyl)-6- methyl-4-(2-((1-methyl- 1H-...)
Affinity DataIC50: <0.0200nM. Assay description: Compounds were tested in an enzymatic assay using human ERK-2 (Mitogen Activated Kinase 1), recombinantly expressed as an n-terminal 6-His fusion pro...
Ligand InfoPC cidPC sid
In DepthDetails US Patent
TargetMitogen-activated protein kinase 1(Homo sapiens (Human))
Genentech
US Patent
LigandPNGBDBM365128(9-(4-methoxybenzyl)-6- methyl-4-(2-((1-methyl- 1H-...)
Affinity DataIC50: <0.0200nM. Assay description: Compounds were tested in an enzymatic assay using human ERK-2 (Mitogen Activated Kinase 1), recombinantly expressed as an n-terminal 6-His fusion pro...
Ligand InfoPC cidPC sid
In DepthDetails US Patent