BDBM366113 US9873693, Compound 36
SMILES C[Si](C)(C)CCOCn1nc(NC(=O)c2cccn(Cc3ccc(F)c(F)c3)c2=O)c2cc(ccc12)-c1c[nH]c2ncccc12
InChI Key InChIKey=UXZBMEOLTUDIIM-UHFFFAOYSA-N
Data  1 IC50
  Tab Delimited (TSV)   2D SDfile   Computed 3D by Vconf -m prep SDfile
Find this compound or compounds like it in BindingDB:
Activity Spreadsheet -- Enzyme Inhibition Constant Data from BindingDB
Found 1 hit for monomerid = 366113
Target3-phosphoinositide-dependent protein kinase 1 [51-360](Homo sapiens (Human))
Sunesis Pharmaceuticals
US Patent
LigandPNGBDBM366113(US9873693, Compound 36)
Affinity DataIC50: <500nM. Assay description: A PDK1 kinase assay was performed as follows. PDK1 (amino acids 51-360) and AKT2 (amino acids 140-467 fused to PIFtide, amino acids EEQEMFRDFDYIADW) ...
Ligand InfoPC cidPC sid
In DepthDetails US Patent