BDBM367185 5-fluoro-2-oxo-N-(4- phenylbutyl)-1,3- benzoxazole-3-carboxamide::US10226452, Example 2
SMILES Fc1ccc2oc(=O)n(C(=O)NCCCCc3ccccc3)c2c1
InChI Key InChIKey=UEJYFBZAWBPORU-UHFFFAOYSA-N
Data  2 IC50
  Tab Delimited (TSV)   2D SDfile   Computed 3D by Vconf -m prep SDfile
Find this compound or compounds like it in BindingDB:
Activity Spreadsheet -- Enzyme Inhibition Constant Data from BindingDB
Found 2 hits for monomerid = 367185
TargetAcid ceramidase(Homo sapiens (Human))
Fondazione Istituto Italiano Di Tecnologia
Curated by ChEMBL
LigandPNGBDBM367185(5-fluoro-2-oxo-N-(4- phenylbutyl)-1,3- benzoxazole...)
Affinity DataIC50:  12nM. Assay description: Inhibition of recombinant human acid ceramidase expressed in HEK293 cells using N-[(1S,2R)-2-hydroxy-1-(hydroxymethyl)-4-(2-oxochromen-7-yl)-oxybutyl...
Ligand InfoPC cidPC sid
In DepthDetails ArticlePubMed
TargetAcid ceramidase(Homo sapiens (Human))
Fondazione Istituto Italiano Di Tecnologia
Curated by ChEMBL
LigandPNGBDBM367185(5-fluoro-2-oxo-N-(4- phenylbutyl)-1,3- benzoxazole...)
Affinity DataIC50:  56nM. Assay description: The assay was performed in Optiplate 96-wells black plates, with each reaction well containing a mixture of 25 mM sodium acetate buffer pH 4.5 and a ...
Ligand InfoPC cidPC sid
In DepthDetails US Patent