BDBM36848 Cyclohexanecarboxylic acid ethyl-(5-pyridin-3-yl-[1,3,4]thiadiazol-2-yl)-amide::MLS000069062::N-ethyl-N-(5-pyridin-3-yl-1,3,4-thiadiazol-2-yl)cyclohexanecarboxamide;hydrochloride::N-ethyl-N-[5-(3-pyridinyl)-1,3,4-thiadiazol-2-yl]cyclohexanecarboxamide;hydrochloride::N-ethyl-N-[5-(3-pyridyl)-1,3,4-thiadiazol-2-yl]cyclohexanecarboxamide;hydrochloride::SMR000005347::cid_6603155
SMILES CCN(C(=O)C1CCCCC1)c1nnc(s1)-c1cccnc1
InChI Key InChIKey=YDVDNNQOLPJCPA-UHFFFAOYSA-N
Data  3 EC50
  Tab Delimited (TSV)   2D SDfile   Computed 3D by Vconf -m prep SDfile
Find this compound or compounds like it in BindingDB:
Activity Spreadsheet -- Enzyme Inhibition Constant Data from BindingDB
Found 3 hits for monomerid = 36848
TargetSphingosine 1-phosphate receptor 1(Homo sapiens (Human))
The Scripps Research Institute Molecular Screening Center
Curated by PubChem BioAssay
LigandPNGBDBM36848(Cyclohexanecarboxylic acid ethyl-(5-pyridin-3-yl-[...)
Affinity DataEC50: >9.51E+4nM. Assay description: Source (MLSCN Center Name): The Scripps Research Institute Molecular Screening Center Center Affiliation: The Scripps Research Institute, TSRI Assay ...
Ligand InfoPC cidPC sid
In DepthDetails PCBioAssay
TargetSphingosine 1-phosphate receptor 1(Homo sapiens (Human))
The Scripps Research Institute Molecular Screening Center
Curated by PubChem BioAssay
LigandPNGBDBM36848(Cyclohexanecarboxylic acid ethyl-(5-pyridin-3-yl-[...)
Affinity DataEC50:  1.75E+3nM. Assay description: Source (MLSCN Center Name): The Scripps Research Institute Molecular Screening Center Center Affiliation: The Scripps Research Institute, TSRI Assay ...
Ligand InfoPC cidPC sid
In DepthDetails PCBioAssay
TargetSphingosine 1-phosphate receptor 1(Homo sapiens (Human))
The Scripps Research Institute Molecular Screening Center
Curated by PubChem BioAssay
LigandPNGBDBM36848(Cyclohexanecarboxylic acid ethyl-(5-pyridin-3-yl-[...)
Affinity DataEC50:  2.13E+3nM. Assay description: Source (MLSCN Center Name): The Scripps Research Institute Molecular Screening Center Center Affiliation: The Scripps Research Institute, TSRI Assay ...
Ligand InfoPC cidPC sid
In DepthDetails PCBioAssay